program: Gaussian 09
title: 000138286
version: EM64L-G09RevD.01
frameworkgroup: C1[X(C7H12O)]
method: RPBEPBE
basis: SDD
operation: Freq
keyword: #pfreq=noraman
keyword: PBEPBE/SDD
title: #p freq=noraman PBEPBE/SDD
converged: YES YES NO NO
title: Mulliken charges:
elementType: O C C C C C C C H H H H H H H H H H H H
charge: -0.196015 0.250333 -0.469541 -0.448080 -0.499855 0.110834 -0.735051 -0.725672 0.223513 0.210968 0.215950 0.226643 0.254289 0.238101 0.239810 0.210904 0.213640 0.240164 0.220797 0.218267
chargesum: 0.00000
title: Mulliken charges with hydrogens summed into heavy atoms:
elementType: O C C C C C C C
charge: -0.196015 0.250333 -0.035060 -0.005486 -0.007465 0.110834 -0.070697 -0.046445
polarizability: 7.96640543e+01 8.96248738e-01 7.53273089e+01 5.60067999e-01 1.37417477e-02 6.52528108e+01
1716.lowfreq: -18.1887 -14.6479 -3.5269 -0.0007 -0.0006 0.0006 71.4758 183.3155 198.2457
frequency: 71.3400 183.2997 198.2298 210.1446 230.2024 280.2667 332.7405 360.2009 480.2267 519.9406 560.9232 621.2278 662.2975 795.5883 821.8904 886.1287 917.1287 942.8909 951.6818 973.7844 1028.9627 1035.9813 1058.1178 1072.9488 1158.8589 1199.0224 1216.7146 1227.1722 1244.8055 1269.5388 1305.6283 1315.8399 1369.9106 1390.2971 1427.3110 1457.1005 1466.1151 1473.9976 1476.6586 1483.4055 1488.3301 1652.2135 2975.6757 2977.3294 2984.4117 2988.8329 3005.8792 3057.4425 3066.4930 3069.7466 3073.8572 3078.7884 3083.1454 3086.8192
redmass: 2.9271 1.2995 1.8431 1.8459 1.1508 2.6998 2.3323 2.0596 3.4038 2.0857 3.4518 3.3293 3.4622 1.9732 1.8599 1.9021 2.3532 1.5738 1.5728 1.3154 1.8603 1.6457 1.5728 2.4150 1.6586 1.8203 2.2330 2.5153 1.6841 1.4271 1.3505 1.6449 1.1866 1.2031 1.0798 1.0554 1.0501 1.0708 1.0722 1.0686 1.0722 11.5100 1.0343 1.0360 1.0657 1.0623 1.0644 1.0995 1.0959 1.1003 1.0992 1.1022 1.1007 1.0994
irintensity: 4.3052 0.4204 0.4903 1.3904 1.0327 3.1151 1.0302 0.1627 3.4307 2.8902 1.1845 1.5629 1.4605 13.7517 3.7323 2.4569 3.6687 3.5931 10.0137 2.5468 15.6147 4.0433 2.5285 53.1994 18.7055 1.8835 7.5494 5.9500 8.4042 2.5471 0.5108 1.6180 16.4129 16.5982 21.1032 1.9522 1.2595 16.0587 5.2075 19.0720 12.5838 150.5661 32.5052 19.0200 13.0583 38.0576 29.4452 22.7180 16.2262 13.4588 51.8510 37.3872 19.5578 37.0319
temp: 298.150 k
press: 1.00000 atm
elementType: 8 6 6 6 6 6 6 6 1 1 1 1 1 1 1 1 1 1 1 1
symmnumber: 1
zpe: 456180.9 jmol-1
zpe.correction: 0.173750 hartree
zpe.thermalcorrener: 0.182356 hartree
zpe.thermalcorrenthalpy: 0.183300 hartree
zpe.thermalcorrgfe: 0.141077 hartree
zpe.sumelectzpe: -348.528007 hartree
zpe.sumelectthermal: -348.519401 hartree
zpe.sumelectthermalent: -348.518457 hartree
zpe.sumelectthermalfe: -348.560681 hartree
dipole: -1.1941 -2.9383 -0.1959
dipole: 3.1777
quadrupole: -47.4953 -57.2416 -48.0104
quadrupole: -2.5356 0.3866 -0.6469
quadrupole: 3.4205 -6.3258 2.9054 -2.5356 0.3866 -0.6469
hfenergy: -348.7017576 hartree
pointgroup: C01 [X(C7H12O1)]
dipole: -0.4319846 1.1720914 0.0513231 debye
dipolederiv: -0.5697853 0.1600382 0.0075596 0.1338296 -0.9555504 -0.0110721 0.0041833 -0.0427328 -0.3174605 -0.1564829 -0.2172807 0.0299467 -0.1862607 -0.1952944 0.0269747 0.0279589 0.0629885 0.0647338 -0.0129684 -0.0158312 -0.0368582 0.0310965 0.0754393 -0.0435653 -0.0103876 0.006539 0.0915771 0.0224655 -0.0045213 -0.0590879 -0.0281649 0.058799 0.0122851 -0.0201929 -0.0189136 0.1422661 -0.4807857 0.0914781 0.0572287 -0.0180312 -0.0343741 0.0084996 0.0604559 -0.0431739 0.1370885 1.0000491 -0.0049948 -0.0723556 0.0510371 1.0421052 -0.0094878 -0.0417279 0.0469819 0.043938 0.0151522 0.0621247 -0.0258261 0.0165067 0.0218841 -0.0037492 -0.0058759 0.0157299 0.029591 0.0511244 0.0155107 0.0167166 -0.003407 0.0124122 0.0167257 -0.0368262 -0.0729369 -0.0030368 0.0338537 -0.0809297 0.0083834 -0.0545038 -0.1494048 0.0434254 0.0074557 0.087406 0.0615413 0.0339866 0.0080099 0.0153407 0.0054525 0.0741203 0.0057206 0.0099466 -0.0515518 -0.1868831 0.0838815 -0.0181551 -0.0002474 -0.0128613 0.0260534 0.0364667 -0.0543407 0.0644482 -0.1609967 -0.1221284 0.0990884 0.0593652 0.0880798 0.0159884 -0.0314098 0.0965206 -0.0538863 0.045592 0.0347324 -0.0506771 -0.0473231 -0.0430895 -0.0208955 -0.0713196 -0.1031809 -0.0755806 0.0299735 0.0793276 0.0089947 0.0194332 0.0267843 0.0571713 0.0404356 0.0569965 0.0812021 -0.0644358 -0.0071915 0.0810825 0.0071349 0.1412424 -0.0136111 -0.0255807 0.0412257 -0.0556808 0.0752165 -0.0103942 -0.1070108 -0.0291003 -0.1425872 -0.0858084 -0.0080773 -0.0111146 0.0217233 0.0775081 0.0430963 -0.013282 0.0983947 -0.0096744 0.0912186 0.0312061 0.0343333 0.0280697 -0.1503967 0.0003701 0.0822596 0.0703727 0.1207144 -0.0246799 -0.0663704 0.0387293 -0.0205225 0.0618363 -0.0443939 0.0246153 -0.1524411 0.0110772 0.088944 0.0278281 -0.1065773 0.0186059 -0.0392118 0.0060908 -0.1205195 0.0333634 -0.1272405 -0.0845171 0.0210646 0.0124182 0.0012849 0.0615591 unknown
polarizability: 79.617543|-1.0446563|75.3921674|-0.1595077|-0.1178718|65.2344637 unknown
InChI: InChI=1S/C7H12O/c1-7(2)5-3-4-6(7)8/h3-5H2,1-2H3
charge 0 multiplicity 1
20 atoms
O  0.317263 -2.092197 -0.064603
C  0.660732 0.372258 0.050635
C  -0.394452 1.447223 0.442242
C  -1.745324 0.926851 -0.1322
C  -1.669737 -0.605667 0.071735
C  -0.170424 -0.938673 0.012041
C  1.839943 0.251992 1.040804
C  1.20332 0.613454 -1.391387
H  -0.13011 2.449822 0.061605
H  -0.461399 1.517187 1.546004
H  -1.823155 1.165467 -1.209323
H  -2.616242 1.382145 0.369283
H  -2.240596 -1.209031 -0.654886
H  -2.033874 -0.89106 1.080164
H  2.484732 -0.601683 0.76597
H  2.451631 1.173298 1.031221
H  1.482454 0.088058 2.074141
H  1.841679 -0.230658 -1.707369
H  0.38748 0.722204 -2.129613
H  1.80798 1.53901 -1.410861
