program: Gaussian 09
title: 000138285
version: EM64L-G09RevD.01
frameworkgroup: C1[X(C12H20N2O2)]
method: RPBEPBE
basis: SDD
operation: Freq
keyword: #p
keyword: freq=noraman
keyword: PBEPBE/SDD
title: #p freq=noraman PBEPBE/SDD
converged: YES YES NO NO
title: Mulliken charges:
elementType: O O N N C C C C C C C C C C C C H H H H H H H H H H H H H H H H H H H H
charge: -0.194163 -0.194257 0.027253 0.026543 -0.383474 -0.385265 -0.375595 -0.373443 -0.366716 -0.369431 -0.373622 -0.372802 -0.441758 -0.440729 0.039771 0.039996 0.197321 0.192433 0.197163 0.192856 0.195968 0.189678 0.196391 0.189008 0.187188 0.221352 0.187566 0.221552 0.202443 0.216917 0.202626 0.216634 0.227562 0.237872 0.237894 0.227267
chargesum: 0.00000
title: Mulliken charges with hydrogens summed into heavy atoms:
elementType: O O N N C C C C C C C C C C C C
charge: -0.194163 -0.194257 0.027253 0.026543 0.006280 0.004753 0.010051 0.011957 0.041824 0.039687 0.045738 0.046459 0.023677 0.024432 0.039771 0.039996
polarizability: 1.84780061e+02 -6.05173911e-01 1.32398545e+02 1.77044145e+01 -1.76378807e-01 1.28746675e+02
1716.lowfreq: -11.9406 -3.4739 -0.0004 0.0007 0.0009 0.4066 9.4655 17.1387 24.9191
frequency: 9.4346 16.2260 24.8470 39.3111 45.0641 50.8972 64.7899 81.1278 92.2207 109.9553 118.0811 132.9040 146.7182 152.1512 157.3625 207.0502 231.0610 300.4436 314.7373 402.9420 444.8564 492.1543 504.9616 505.2368 523.5683 532.0126 533.0522 721.2116 723.1884 726.8965 741.6223 770.6770 809.7885 841.3978 863.4316 886.5835 941.4123 983.8773 986.5026 1013.4337 1026.4371 1039.2232 1068.8796 1077.6367 1081.9929 1088.9337 1105.7034 1136.2448 1143.5446 1198.5610 1205.4870 1225.4450 1244.2425 1250.0468 1274.4696 1275.1995 1281.2909 1289.1732 1296.6203 1296.8524 1301.4316 1328.3480 1348.1796 1348.2893 1351.6835 1357.0985 1365.8794 1367.0513 1407.1023 1407.3578 1454.0444 1454.8637 1460.8117 1462.1897 1465.8875 1470.0208 1470.6127 1473.9140 1482.5289 1488.0910 2321.8501 2322.8829 2949.9787 2951.0850 2953.0987 2958.6493 2961.2187 2961.7380 2963.1119 2965.7228 2981.0838 2981.5143 2984.8552 2992.1754 3004.6409 3014.6254 3016.6002 3019.8972 3027.3278 3037.5060 3052.5442 3053.9307
redmass: 7.1469 4.9945 5.4531 3.7025 3.8996 3.0911 5.1302 2.3510 4.9883 2.3062 4.7985 2.2280 2.4614 2.9891 3.5511 2.4532 2.2826 3.5144 2.9642 3.2700 3.3694 2.7157 12.1993 11.7220 3.0863 11.0352 7.5812 1.0754 1.2954 1.5648 1.5895 1.6729 1.6933 1.7502 1.6056 1.5233 1.4532 3.6944 2.3606 1.6796 2.3871 2.5734 2.8857 2.4447 2.0753 2.1791 3.4625 1.7479 1.5031 1.2223 1.4800 1.2453 1.3428 1.2336 1.2191 1.2330 1.0350 1.0741 1.1439 1.1305 1.2104 1.3278 1.2871 1.2950 1.4533 1.6733 1.5543 1.5401 10.7553 10.7736 1.0846 1.0848 1.0698 1.0699 1.0774 1.0860 1.0859 1.0958 1.0997 1.1007 12.3085 12.3157 1.0586 1.0587 1.0595 1.0606 1.0579 1.0575 1.0614 1.0608 1.0630 1.0635 1.0932 1.0966 1.0987 1.1005 1.1021 1.1019 1.1027 1.1045 1.1040 1.1039
irintensity: 1.5826 0.4306 1.6443 0.8747 0.6857 0.9176 0.0906 2.5850 4.4338 0.5829 1.5299 0.1965 3.5856 7.1689 1.6439 0.9890 3.9812 6.2536 0.9263 3.0595 8.8129 21.0174 10.5967 19.8030 1.9366 34.4669 2.0225 11.8762 1.7769 2.5110 2.7896 15.5831 1.2019 3.6956 1.6711 6.6708 3.1413 5.6054 6.7054 0.7305 1.4790 8.0175 2.0305 2.4400 0.1324 4.0959 1.4475 8.2784 0.1454 24.7467 12.3129 0.4979 0.4939 1.3388 0.0029 2.7253 2.0800 0.1965 0.3395 0.0654 0.5111 0.0313 44.1476 48.8874 0.4277 2.7723 10.9229 7.9305 1.1107 1.1030 2.6812 5.0846 0.1045 0.0092 0.0156 39.3755 14.4077 9.2017 0.0365 30.5464 1185.1503 670.9503 2.7715 0.3639 0.6454 3.2548 32.5174 29.8734 29.7752 141.7748 46.4329 39.0771 16.9870 1.5656 2.1669 0.2159 69.3888 3.6420 14.8790 42.0476 7.4041 251.8209
temp: 298.150 k
press: 1.00000 atm
elementType: 8 8 7 7 6 6 6 6 6 6 6 6 6 6 6 6 1 1 1 1 1 1 1 1 1 1 1 1 1 1 1 1 1 1 1 1
symmnumber: 1
zpe: 799049.2 jmol-1
zpe.correction: 0.304342 hartree
zpe.thermalcorrener: 0.323952 hartree
zpe.thermalcorrenthalpy: 0.324896 hartree
zpe.thermalcorrgfe: 0.249605 hartree
zpe.sumelectzpe: -727.962499 hartree
zpe.sumelectthermal: -727.942888 hartree
zpe.sumelectthermalent: -727.941944 hartree
zpe.sumelectthermalfe: -728.017236 hartree
dipole: -0.0346 -5.6026 -0.2338
dipole: 5.6076
quadrupole: -135.0862 -103.6808 -99.0574
quadrupole: 1.2594 -29.2792 -0.0648
quadrupole: -22.4781 8.9274 13.5507 1.2594 -29.2792 -0.0648
hfenergy: -728.2668405 hartree
pointgroup: C01 [X(C12H20N2O2)]
dipole: -0.0065278 0.0589433 -2.2053957 debye
polarizability: 185.019629|-17.330236|128.5149089|-0.163728|0.1698717|132.3907425 unknown
InChI: InChI=1S/C12H20N2O2/c15-11-13-9-7-5-3-1-2-4-6-8-10-14-12-16/h1-10H2
charge 0 multiplicity 1
36 atoms
O  -7.414933 1.239929 2.131748
O  7.444931 -1.301172 2.103133
N  -6.012789 -0.052681 0.616165
N  6.029859 0.050189 0.652216
C  -0.712593 0.292945 -0.576611
C  0.729989 -0.258669 -0.626415
C  -1.792977 -0.810037 -0.637934
C  1.806462 0.847092 -0.547367
C  -3.232027 -0.249679 -0.593107
C  3.249341 0.296176 -0.582608
C  -4.309664 -1.353493 -0.620916
C  4.31688 1.407831 -0.505699
C  -5.75193 -0.804684 -0.597329
C  5.764426 0.873015 -0.513294
C  -6.76675 0.585264 1.327133
C  6.790192 -0.613884 1.331712
H  -0.84685 0.882871 0.353961
H  -0.863207 1.00171 -1.417962
H  0.878059 -0.973576 0.209765
H  0.869119 -0.840804 -1.561465
H  -1.646519 -1.512249 0.209396
H  -1.656128 -1.407008 -1.56417
H  1.661236 1.431091 0.385401
H  1.6616 1.56012 -1.386413
H  -3.386069 0.437549 -1.451756
H  -3.364611 0.358496 0.323422
H  3.397188 -0.292648 -1.512368
H  3.398398 -0.405709 0.261709
H  -4.200301 -1.965769 -1.538863
H  -4.170345 -2.033693 0.241859
H  4.20907 2.0950 -1.369309
H  4.16298 2.010568 0.410358
H  -5.912654 -0.14623 -1.475482
H  -6.474891 -1.64154 -0.671198
H  6.479058 1.720009 -0.533432
H  5.933349 0.271767 -1.430079
