program: Gaussian 09
title: 000138284
version: EM64L-G09RevD.01
frameworkgroup: C1[X(C14H14S)]
method: RPBEPBE
basis: SDD
operation: Freq
keyword: #pfreq=noraman
keyword: PBEPBE/SDD
title: #p freq=noraman PBEPBE/SDD
converged: YES YES NO NO
title: Mulliken charges:
elementType: S C C C C C C C C C C C C C C H H H H H H H H H H H H H H
charge: 0.215114 -0.341079 -0.362171 0.447156 0.434533 -0.165791 -0.192108 -0.396201 -0.392783 -0.808901 -0.807283 -0.257782 -0.243207 -0.233133 -0.227699 0.264066 0.268052 0.230544 0.233880 0.239191 0.244143 0.223322 0.242797 0.247778 0.220255 0.228880 0.232532 0.227258 0.228640
chargesum: 0.00000
title: Mulliken charges with hydrogens summed into heavy atoms:
elementType: S C C C C C C C C C C C C C C
charge: 0.215114 -0.341079 -0.362171 0.447156 0.434533 0.098275 0.075944 -0.165657 -0.158904 -0.102246 -0.096453 -0.028902 -0.010675 -0.005875 0.000941
polarizability: 2.32865337e+02 -4.16357655e+00 1.57479295e+02 -9.14499879e+00 -3.66889075e-01 1.12572089e+02
1716.lowfreq: -9.3230 -8.2342 -3.0729 -0.0013 -0.0013 -0.0011 13.6822 31.5798 61.5759
frequency: -8.3228 31.1963 61.5450 116.4362 133.0486 144.0558 161.8063 189.1320 225.9800 243.2418 248.1766 356.6548 388.9292 406.5285 434.5788 442.0126 455.0313 507.5433 522.9862 538.7959 549.9027 658.7786 662.2370 712.2724 719.3951 752.0766 759.1248 790.3147 793.5782 864.2363 870.0241 942.8007 950.6752 982.6071 984.6429 986.1824 988.3104 1017.4059 1035.7269 1043.9475 1045.4372 1046.4129 1048.0381 1129.7625 1135.0094 1172.1572 1173.4625 1211.8291 1215.7784 1275.2451 1278.1381 1363.6670 1370.2635 1400.9509 1402.1244 1418.1034 1419.7758 1457.5157 1460.2362 1462.0212 1463.9460 1476.8059 1478.0268 1573.9719 1578.9742 1597.8613 1602.3994 2972.6642 2981.1875 3047.9825 3060.9876 3087.5988 3090.0739 3120.9695 3122.8206 3133.2422 3135.8121 3149.0658 3150.4263 3164.3352 3166.2065
redmass: 4.8071 3.8029 4.6735 1.0706 1.3925 2.0165 3.4092 3.4721 3.8009 4.1733 3.8799 3.7325 6.8695 2.9522 2.9484 5.0092 3.3790 3.5188 3.8371 5.6351 5.8224 6.4277 6.4407 3.4883 3.3015 1.2072 1.2528 4.8043 4.7935 1.2958 1.2957 1.3641 1.3694 1.3312 1.5404 1.5609 1.3573 5.9226 3.8829 2.1860 1.6926 1.5666 2.0653 1.5311 1.5340 1.0584 1.0591 2.3895 2.3861 1.4800 1.4624 8.1133 7.8645 1.2432 1.2341 1.9697 2.0043 1.3318 1.5165 1.2443 1.9776 1.1436 1.1417 5.9599 5.9763 6.3551 6.4902 1.0376 1.0374 1.0967 1.0961 1.0988 1.1000 1.0864 1.0863 1.0886 1.0889 1.0938 1.0941 1.1006 1.1007
irintensity: 0.6714 0.2594 0.1226 0.5008 0.3823 0.2104 0.2864 0.1814 4.0494 4.6433 5.9730 0.4872 1.0240 0.1418 14.3051 0.7907 4.8874 0.1039 0.6705 4.0257 2.0550 10.1141 10.6570 2.9756 3.6398 96.3208 51.5859 2.8110 0.4442 0.1420 0.0264 0.3220 0.1790 0.2106 2.4607 0.9114 0.0695 89.7212 9.8220 3.1006 11.4130 9.1103 0.5690 2.8113 0.0758 1.1551 0.1726 0.3611 0.7966 1.7382 0.5527 1.0447 0.5520 19.0352 19.6876 8.7575 4.0383 7.1601 28.5995 33.3533 17.6237 54.0738 9.6013 16.6694 4.0381 18.2575 4.2636 24.3965 23.1417 15.7095 13.7377 26.7623 22.6760 8.8384 6.5759 11.4135 9.3122 35.3554 10.1022 25.3616 22.8111
temp: 298.150 k
press: 1.00000 atm
elementType: 16 6 6 6 6 6 6 6 6 6 6 6 6 6 6 1 1 1 1 1 1 1 1 1 1 1 1 1 1
symmnumber: 1
zpe: 611968.9 jmol-1
zpe.correction: 0.233087 hartree
zpe.thermalcorrener: 0.246548 hartree
zpe.thermalcorrenthalpy: 0.247492 hartree
zpe.thermalcorrgfe: 0.192513 hartree
zpe.sumelectzpe: -938.888614 hartree
zpe.sumelectthermal: -938.875153 hartree
zpe.sumelectthermalent: -938.874209 hartree
zpe.sumelectthermalfe: -938.929188 hartree
dipole: -0.4619 0.7537 0.2263
dipole: 0.9125
quadrupole: -83.4764 -92.0505 -96.4942
quadrupole: -1.8990 -4.0694 -0.9738
quadrupole: 7.1973 -1.3768 -5.8205 -1.8990 -4.0694 -0.9738
hfenergy: -939.1217006 hartree
pointgroup: C01 [X(C14H14S1)]
dipole: 0.1594039 0.1265649 0.2957147 debye
polarizability: 230.8612769|16.0440208|114.371594|6.9553451|4.8532732|157.6838503 unknown
InChI: InChI=1S/C14H14S/c1-11-7-3-5-9-13(11)15-14-10-6-4-8-12(14)2/h3-10H,1-2H3
charge 0 multiplicity 1
29 atoms
S  0.051486 -0.47072 -1.403864
C  -1.388196 -0.078727 -0.303956
C  1.493951 -0.314717 -0.256578
C  -2.663666 -0.57892 -0.697249
C  2.556392 0.57442 -0.583625
C  -1.243582 0.725636 0.849652
C  1.555554 -1.141112 0.890693
C  -3.778497 -0.250833 0.11639
C  3.674974 0.608292 0.292681
C  -2.838671 -1.430065 -1.940737
C  2.524333 1.459701 -1.815493
C  -2.370235 1.031881 1.643611
C  2.672845 -1.080745 1.75008
C  -3.644356 0.542913 1.277131
C  3.739166 -0.202459 1.446333
H  -0.256546 1.106302 1.130737
H  0.725503 -1.821348 1.107123
H  -4.765628 -0.632787 -0.171072
H  4.502639 1.288793 0.059605
H  -2.620799 -0.854841 -2.861329
H  -2.146504 -2.293127 -1.936386
H  -3.871375 -1.81012 -2.01706
H  2.650968 0.867787 -2.741604
H  1.555552 1.982312 -1.908113
H  3.332354 2.210348 -1.781334
H  -2.249569 1.65412 2.537275
H  2.713285 -1.718876 2.639414
H  -4.523779 0.776381 1.887149
H  4.6147 -0.15019 2.103025
