program: Gaussian 09
title: 000138279
version: EM64L-G09RevD.01
frameworkgroup: C1[X(C10H18Si2)]
method: RPBEPBE
basis: SDD
operation: Freq
keyword: #p
keyword: freq=noraman
keyword: PBEPBE/SDD
title: #p freq=noraman PBEPBE/SDD
converged: YES YES NO NO
title: Mulliken charges:
elementType: Si Si C C C C C C C C C C H H H H H H H H H H H H H H H H H H
charge: 1.255651 1.255386 -1.004583 -1.004820 -1.004710 -1.004717 -1.004495 -1.004591 -0.171804 -0.171909 -0.245902 -0.245762 0.245155 0.245178 0.234981 0.235035 0.245249 0.245198 0.245228 0.245155 0.235011 0.245176 0.235054 0.245204 0.235012 0.245150 0.245111 0.235034 0.245133 0.245191
chargesum: 0.00000
title: Mulliken charges with hydrogens summed into heavy atoms:
elementType: Si Si C C C C C C C C C C
charge: 1.255651 1.255386 -0.279269 -0.279338 -0.279316 -0.279282 -0.279222 -0.279233 -0.171804 -0.171909 -0.245902 -0.245762
polarizability: 2.89830019e+02 2.24539071e-02 1.28702338e+02 5.83064214e-02 -2.60865814e-04 1.28695810e+02
1716.lowfreq: -21.2712 -20.8754 0.0013 0.0014 0.0017 1.1454 1.5908 31.5924 31.9038
frequency: -20.8538 31.3285 31.8389 75.1176 75.3629 125.4966 125.5597 140.0228 140.4157 149.8988 150.9237 153.3918 163.1352 163.1913 192.5989 192.7585 210.6962 210.7918 213.8322 303.2765 303.3399 338.6641 386.3866 386.4318 526.4634 526.4787 535.1881 606.0342 635.8262 695.3467 695.8852 697.3558 697.5227 746.0959 746.1545 818.6007 819.5948 820.0196 820.9880 906.8952 906.9890 907.8333 907.8796 915.7735 924.5607 1101.5410 1293.8282 1294.1129 1295.1569 1295.4142 1307.0291 1307.2770 1437.4380 1437.5304 1445.4217 1445.5009 1446.1473 1446.2360 1450.3154 1450.4419 1451.3149 1451.4286 1462.3359 1462.6207 2067.5947 2227.2548 2984.9704 2985.1055 2985.1880 2985.3178 2985.9300 2986.1665 3087.9096 3088.1195 3088.3070 3088.4888 3090.4086 3090.8096 3095.8745 3095.9772 3096.9848 3097.0890 3097.3756 3097.4419
redmass: 2.8863 3.7832 3.7819 3.3596 3.3733 1.0142 1.0139 1.0532 1.0384 1.1460 1.0477 2.0788 3.4871 3.4689 2.5206 2.5233 3.0219 3.0259 2.6592 5.3436 5.3420 4.4905 7.5342 7.5330 11.2809 11.2847 5.6046 4.0941 5.0654 3.2926 3.2972 3.2734 3.2701 1.1665 1.1664 1.3459 1.3470 1.3475 1.3488 1.4837 1.4835 1.4821 1.4823 1.5062 1.5026 11.8203 1.1993 1.1993 1.1990 1.1991 1.1871 1.1871 1.0548 1.0548 1.0540 1.0540 1.0539 1.0538 1.0486 1.0486 1.0486 1.0486 1.0470 1.0468 12.0082 12.0007 1.0341 1.0340 1.0341 1.0340 1.0339 1.0339 1.0984 1.0984 1.0985 1.0985 1.0978 1.0978 1.0992 1.0992 1.0987 1.0987 1.0986 1.0986
irintensity: 0.0110 1.2738 1.2708 0.0009 0.0009 0.0010 0.0011 0.0060 0.0253 0.0032 0.0061 0.0008 1.0382 1.0335 0.0328 0.0149 4.6264 4.5721 11.5984 0.0040 0.0008 0.0004 20.7442 20.7560 0.0479 0.0001 40.5537 0.0023 126.4738 10.3583 10.1789 11.2910 11.0299 0.0187 0.0145 18.6362 15.6337 27.5246 24.4342 44.2625 37.2130 130.9451 124.2530 770.8610 0.0165 0.0002 35.6525 35.9272 39.0726 39.5275 5.2711 10.3351 0.0079 0.0050 0.0537 0.0325 0.0507 0.0503 11.0889 9.9952 11.6336 10.4394 22.2507 0.0354 126.3798 0.0003 12.9217 11.8086 14.7606 13.4084 40.6702 3.5874 2.2638 2.1710 2.6384 2.5702 72.6437 35.4933 2.5878 2.5507 17.6519 16.6857 22.5683 22.0072
temp: 298.150 k
press: 1.00000 atm
elementType: 14 14 6 6 6 6 6 6 6 6 6 6 1 1 1 1 1 1 1 1 1 1 1 1 1 1 1 1 1 1
symmnumber: 1
zpe: 632378.0 jmol-1
zpe.correction: 0.240860 hartree
zpe.thermalcorrener: 0.259812 hartree
zpe.thermalcorrenthalpy: 0.260757 hartree
zpe.thermalcorrgfe: 0.193369 hartree
zpe.sumelectzpe: -969.672353 hartree
zpe.sumelectthermal: -969.653401 hartree
zpe.sumelectthermalent: -969.652457 hartree
zpe.sumelectthermalfe: -969.719844 hartree
dipole: 0.0025 0.0153 -0.0066
dipole: 0.0168
quadrupole: -69.4893 -89.8558 -89.8551
quadrupole: -0.0076 0.0046 0.0001
quadrupole: 13.5774 -6.7891 -6.7884 -0.0076 0.0046 0.0001
hfenergy: -969.9132133 hartree
pointgroup: C01 [X(C10H18Si2)]
dipole: -0.0009899 -0.0045548 -0.0046951 debye
polarizability: 289.8299398|0.0862291|128.701225|-0.0960062|0.0024594|128.6970023 unknown
InChI: InChI=1S/C10H18Si2/c1-11(2,3)9-7-8-10-12(4,5)6/h1-6H3
charge 0 multiplicity 1
30 atoms
Si -3.801997 0.000428 0.003143
Si 3.806731 0.002908 -0.000402
C  -4.392279 -1.768655 -0.417643
C  -4.409861 0.520526 1.739092
C  -4.398973 1.24176 -1.322389
C  4.412592 1.739579 -0.520987
C  4.407646 -0.421678 1.764356
C  4.394755 -1.321007 -1.248009
C  -1.934479 0.00601 0.009285
C  1.939379 0.010141 0.004905
C  -0.68382 0.007606 0.009041
C  0.688724 0.009899 0.007431
H  -4.021029 -2.08144 -1.409846
H  -4.026016 -2.495477 0.329205
H  -5.497153 -1.814813 -0.431735
H  -5.515135 0.527746 1.775409
H  -4.043776 -0.179416 2.511218
H  -4.049536 1.532542 1.996307
H  -4.036555 2.261352 -1.10058
H  -4.02837 0.957465 -2.323423
H  -5.503985 1.267993 -1.357909
H  4.052391 2.510109 0.183769
H  5.517759 1.774817 -0.536487
H  4.044619 1.999588 -1.529531
H  5.512678 -0.438912 1.80354
H  4.047783 0.325285 2.494263
H  4.035386 -1.413229 2.078055
H  5.499475 -1.35664 -1.282688
H  4.025937 -2.322239 -0.962048
H  4.024408 -1.09775 -2.264442
