program: Gaussian 09
title: 000138273
version: EM64L-G09RevD.01
frameworkgroup: C1[X(C9H9Br)]
method: RPBEPBE
basis: SDD
operation: Freq
keyword: #pfreq=noraman
keyword: PBEPBE/SDD
title: #p freq=noraman PBEPBE/SDD
converged: YES YES NO NO
title: Mulliken charges:
elementType: Br C C C C C C C C C H H H H H H H H H
charge: 0.002366 0.515777 -0.385763 -0.395154 -0.317844 -0.188742 -0.195732 -0.215696 -0.153527 -0.739704 0.228255 0.234187 0.221838 0.247822 0.249570 0.212497 0.227452 0.227506 0.224891
chargesum: 0.00000
title: Mulliken charges with hydrogens summed into heavy atoms:
elementType: Br C C C C C C C C C
charge: 0.002366 0.515777 -0.157508 -0.160967 -0.096006 0.059080 0.053838 -0.215696 0.058970 -0.059854
polarizability: 2.19122747e+02 7.69594352e+00 1.00279467e+02 -1.11848583e-02 -1.35884468e-03 4.72279299e+01
1716.lowfreq: -8.6451 -0.0003 -0.0002 0.0002 2.6319 2.7459 45.5751 86.2481 109.9146
frequency: 45.5650 86.2338 109.9099 170.1364 186.1213 233.9008 240.2272 339.5438 376.4650 407.6698 439.9104 504.1000 624.6938 644.7006 707.9947 795.4841 813.7300 825.4883 857.3704 947.1585 951.7858 967.0469 986.9132 992.5017 1042.3624 1061.9461 1099.8221 1122.0087 1189.7297 1224.1799 1291.6098 1301.1494 1316.8751 1372.4934 1393.5012 1398.9175 1458.3133 1467.9917 1475.4814 1570.6033 1595.6728 1671.4739 2963.0113 3034.6707 3073.9913 3081.9166 3099.8084 3128.6951 3140.8099 3168.0888 3171.8879
redmass: 3.6483 1.7415 4.3240 3.0335 1.4001 6.3973 5.7971 3.9477 3.4574 2.8566 4.9263 2.5549 7.0255 5.4711 3.0238 1.4025 3.4952 1.2786 1.7742 1.7879 1.3322 1.3769 1.1484 4.7605 1.5485 2.5469 1.9144 1.6456 1.1162 2.0501 1.3624 1.5065 1.4064 3.6109 1.2992 2.8800 1.0474 1.1322 2.1448 6.9921 6.0591 5.6188 1.0368 1.0965 1.0949 1.0923 1.0907 1.0897 1.0882 1.0956 1.0959
irintensity: 0.0487 0.1591 0.0483 2.0946 0.5853 0.5187 3.1867 3.1479 0.8368 0.0343 7.6144 19.8773 0.8252 8.4223 0.3517 48.6489 8.6172 3.4555 21.5862 36.4846 5.5365 0.0465 56.6828 37.9506 1.0975 37.7974 1.9184 5.5767 2.2933 2.0448 0.5481 1.5188 1.8874 2.4902 7.5715 6.3107 15.1033 14.9275 86.1603 0.1005 5.6721 17.6006 46.5596 24.2616 7.2279 10.0107 57.3186 14.6555 7.6554 12.4678 1.4543
temp: 298.150 k
press: 1.00000 atm
elementType: 35 6 6 6 6 6 6 6 6 6 1 1 1 1 1 1 1 1 1
symmnumber: 1
zpe: 389813.1 jmol-1
zpe.correction: 0.148472 hartree
zpe.thermalcorrener: 0.158443 hartree
zpe.thermalcorrenthalpy: 0.159387 hartree
zpe.thermalcorrgfe: 0.111517 hartree
zpe.sumelectzpe: -361.084067 hartree
zpe.sumelectthermal: -361.074096 hartree
zpe.sumelectthermalent: -361.073152 hartree
zpe.sumelectthermalfe: -361.121023 hartree
dipole: -2.9346 -0.0096 0.0026
dipole: 2.9346
quadrupole: -62.0580 -60.5748 -73.9567
quadrupole: 1.2016 -0.0125 -0.0007
quadrupole: 3.4718 4.9550 -8.4269 1.2016 -0.0125 -0.0007
hfenergy: -361.2325392 hartree
pointgroup: C01 [X(C9H9Br1)]
dipole: -1.1540769 -0.0333768 0.0054569 debye
dipolederiv: -0.8550278 -0.0679812 0.0024107 -0.0938601 -0.0840717 -0.0012168 0.0011152 -0.0015387 -0.0441818 0.4119673 -0.0399436 -0.0043027 -0.0488045 -0.0834853 -0.0074025 -0.0047745 -0.0074904 0.0767199 -0.0972397 -0.0385817 -0.0024718 -0.0525051 0.0407218 0.0099858 -0.0030476 0.0097906 -0.1525886 -0.1123545 0.0707736 0.002906 0.039274 0.07224 0.0122586 0.0018459 0.0120333 -0.1811315 -0.068357 0.048385 0.0011134 0.3251308 0.1104581 0.0121023 0.0135343 0.0142714 -0.1893533 -0.4031718 0.0526755 0.0048816 0.0371172 0.0505429 0.0067548 0.0040385 0.0066484 -0.0917084 -0.3116426 -0.1497623 -0.0058267 -0.125859 0.0157879 0.0061126 -0.0048934 0.006443 -0.0909196 1.326252 0.1431999 -0.0034377 0.1225085 0.0340388 0.0076491 -0.0042425 0.0075448 -0.1389586 0.3028389 -0.0171721 -0.0038102 -0.0046698 0.1169481 0.0165213 -0.0008622 0.0160018 -0.2325315 -0.2414795 -0.0093857 0.0014215 0.1417663 0.049619 -0.002889 0.0055856 -0.0013778 0.0888048 -0.0082509 0.1029098 0.0062501 0.0738662 -0.0208424 -0.0088188 0.0048568 -0.0089787 0.1463866 0.0154319 -0.0972527 -0.0037402 -0.0725763 -0.0621673 -0.0103173 -0.0024765 -0.0101147 0.1568709 0.0083759 -0.0289153 -0.0002096 -0.1119713 -0.1047888 -0.0115815 -0.0041477 -0.0122881 0.1542542 0.0611984 -0.0625058 -0.002359 -0.069492 -0.0327239 -0.0090564 -0.0027281 -0.0091045 0.1605672 0.02988 0.0840119 0.0050914 0.0855235 0.0023163 -0.0085346 0.0051945 -0.0085492 0.1623705 0.0238979 -0.0859669 -0.003188 -0.0989021 -0.1100933 -0.0120152 -0.0041145 -0.0119888 0.157724 -0.0660638 0.0375336 0.0789774 -0.0213548 0.082397 -0.088093 0.150628 -0.0802431 -0.0543807 -0.069135 0.0453987 -0.0746848 -0.0072046 0.0667249 0.0988618 -0.1509909 0.0903979 -0.0362304 0.0528803 0.0125792 0.0009786 -0.1179869 -0.1436221 -0.0103212 -0.0045209 -0.0114572 0.1082863 unknown
polarizability: 219.4844697|-3.8246476|99.781353|-1.3848144|2.5943737|47.3643215 unknown
InChI: InChI=1S/C9H9Br/c1-2-3-8-4-6-9(10)7-5-8/h2-7H,1H3
charge 0 multiplicity 1
19 atoms
Br 4.240688 0.332963 -0.014557
C  -0.531269 -0.240324 -0.008232
C  0.056005 1.056637 0.051148
C  0.345968 -1.3597 -0.069701
C  -1.989331 -0.476448 -0.008685
C  1.454191 1.23018 0.049434
C  1.749141 -1.206351 -0.072389
C  2.289316 0.093306 -0.012457
C  -2.978433 0.461513 0.042754
C  -4.45513 0.150823 0.036596
H  -0.57997 1.946901 0.099682
H  -0.076838 -2.370547 -0.116434
H  -2.291376 -1.533746 -0.056961
H  1.888369 2.233045 0.095653
H  2.404213 -2.080775 -0.120247
H  -2.714858 1.528774 0.091382
H  -4.950974 0.547227 0.944629
H  -4.959401 0.624595 -0.82893
H  -4.642912 -0.936173 -0.010383
