program: Gaussian 09
title: 000138272
version: EM64L-G09RevD.01
frameworkgroup: C1[X(C11H12)]
method: RPBEPBE
basis: SDD
operation: Freq
keyword: #p
keyword: freq=noraman
keyword: PBEPBE/SDD
title: #p freq=noraman PBEPBE/SDD
converged: NO YES NO NO
title: Mulliken charges:
elementType: C C C C C C C C C C C H H H H H H H H H H H H
charge: -0.348569 -0.348569 -0.496259 -0.456869 -0.456869 0.364403 0.364404 -0.479200 -0.479201 -0.231009 -0.231007 0.248879 0.248878 0.248251 0.213168 0.228311 0.226495 0.226494 0.228312 0.243512 0.243513 0.221467 0.221466
chargesum: 0.00000
title: Mulliken charges with hydrogens summed into heavy atoms:
elementType: C C C C C C C C C C C
charge: -0.099690 -0.099690 -0.034840 -0.002063 -0.002062 0.364403 0.364404 -0.235688 -0.235688 -0.009542 -0.009542
polarizability: 1.36800457e+02 2.42815228e-05 1.10083058e+02 4.21002809e+00 -1.04988001e-05 7.34821344e+01
1716.lowfreq: -14.0322 -8.4220 -0.0007 -0.0005 -0.0004 10.2971 129.5864 163.4370 248.0352
frequency: 129.5833 163.4301 248.0330 354.6506 358.1694 406.6870 521.8428 525.7036 541.7131 570.1004 690.2573 706.7030 763.5292 785.9465 808.5985 822.9836 828.9430 873.4308 875.6951 885.4029 917.6197 944.0147 953.4323 961.7629 983.7807 1015.1349 1020.6052 1035.8727 1068.0162 1109.6510 1115.4178 1140.6701 1161.4582 1162.3166 1169.2906 1203.2631 1207.8095 1244.2686 1263.9936 1269.0362 1283.7631 1299.3531 1312.5129 1400.1155 1447.7788 1458.1619 1465.6931 1468.7807 1490.1974 1598.5599 1622.6307 2999.2640 3008.1409 3014.9959 3062.7209 3075.3921 3080.4198 3084.5498 3088.5308 3115.6923 3123.1333 3136.3513 3155.8460
redmass: 3.6173 2.9320 1.9897 3.1532 3.4129 2.4744 4.1745 2.6613 3.5332 4.1561 5.0631 4.6725 1.2433 4.3101 1.7484 3.1806 2.1272 2.6094 2.4132 1.4081 3.2170 1.4771 2.0076 2.1542 1.3099 2.2827 1.6174 1.7674 1.6161 1.1668 1.3145 1.6454 1.3326 1.9509 1.1221 1.7131 1.2644 1.4358 1.3279 1.9410 1.5154 1.6244 1.4682 5.3343 2.3889 2.3365 1.0877 1.1068 1.1828 6.6735 7.4068 1.0601 1.0598 1.0627 1.1032 1.0885 1.1009 1.0975 1.1055 1.0851 1.0896 1.0945 1.1001
irintensity: 2.4196 0.0034 0.0868 0.1663 0.7771 1.2925 0.0326 14.4219 0.7106 0.0871 0.7154 3.4070 83.1882 0.6546 2.8354 0.5201 2.9636 2.4275 2.1073 0.0188 1.7479 1.2766 0.0192 12.9953 0.0303 7.2427 1.6325 0.4525 2.1174 18.1399 1.2930 0.2481 0.2572 2.2739 0.1883 0.0468 0.7228 0.0689 0.2309 1.6964 8.5303 2.3222 5.6144 2.2555 3.4973 10.7581 4.5032 12.6338 12.6937 0.0774 0.1911 28.4689 45.7909 72.6095 2.6570 62.3895 13.2042 54.1954 49.7437 3.0517 4.5046 39.1875 35.4577
temp: 298.150 k
press: 1.00000 atm
elementType: 6 6 6 6 6 6 6 6 6 6 6 1 1 1 1 1 1 1 1 1 1 1 1
symmnumber: 1
zpe: 517991.4 jmol-1
zpe.correction: 0.197293 hartree
zpe.thermalcorrener: 0.205131 hartree
zpe.thermalcorrenthalpy: 0.206076 hartree
zpe.thermalcorrgfe: 0.164899 hartree
zpe.sumelectzpe: -425.573793 hartree
zpe.sumelectthermal: -425.565954 hartree
zpe.sumelectthermalent: -425.565010 hartree
zpe.sumelectthermalfe: -425.606186 hartree
dipole: 0.8817 0.0000 -0.1249
dipole: 0.8905
quadrupole: -60.9788 -60.9211 -68.5056
quadrupole: 0.0000 1.2195 0.0000
quadrupole: 2.4897 2.5474 -5.0371 0.0000 1.2195 0.0000
hfenergy: -425.7710854 hartree
pointgroup: C01 [X(C11H12)]
dipole: -0.3475732 -0.0000011 0.0441608 debye
dipolederiv: -0.0022377 0.0434853 -0.0155801 0.0951914 0.1681185 0.0424843 0.0854842 0.0735708 0.0772309 -0.0022405 -0.0434839 -0.0155832 -0.0951983 0.1681275 -0.0424779 0.0854804 -0.0735667 0.0772222 0.091697 0. -0.0223252 -0.0000009 -0.0672765 -0.0000053 0.0005344 -0.0000048 0.0440438 0.0474089 0.0166347 0.0437945 -0.0343361 -0.0059537 -0.0135686 -0.0261954 -0.0485062 0.0408458 0.0474088 -0.0166382 0.0437935 0.0343377 -0.0059587 0.013565 -0.0261919 0.048502 0.040849 0.2060637 0.0526555 0.0119863 0.2798264 -0.0793329 0.0065894 -0.0414594 -0.0172219 -0.0918884 0.2060647 -0.0526565 0.0119839 -0.2798232 -0.0793317 -0.0065882 -0.0414792 0.0172238 -0.0918862 -0.0857566 -0.0334926 0.0252846 -0.0381982 0.1142265 -0.0008364 0.0273788 -0.0059215 -0.1566612 -0.0857588 0.0334897 0.0252871 0.0381956 0.1142233 0.0008597 0.0273802 0.0059447 -0.1566621 0.0177576 -0.0383739 0.033197 -0.0855345 -0.0165001 -0.0106755 0.0300006 0.0015573 -0.1608508 0.0177614 0.0383719 0.0332011 0.0855326 -0.0164995 0.0106889 0.0300072 -0.0015451 -0.1608492 0.02791 -0.0048475 -0.001893 -0.0487718 -0.1551176 -0.0701124 -0.0185882 -0.0652587 0.0376733 0.0279099 0.0048479 -0.0018923 0.0487727 -0.1551278 0.0700981 -0.0185846 0.0652455 0.0376831 0.0632163 -0.0000043 0.114137 -0.0000025 0.0626485 0.0000084 0.0650577 0.0000083 -0.149555 -0.2387072 0.0000037 -0.0802048 0.0000023 0.0773791 0.0000007 -0.02173 0.0000002 0.0758124 0.0556633 0.0608529 -0.0890161 0.0164312 0.0081583 0.068904 -0.0575019 0.07813 -0.0971943 -0.2064006 -0.119635 0.0366493 -0.0583898 0.0216253 0.0101413 0.0353989 0.0032321 0.0650739 -0.2064008 0.1196327 0.0366576 0.0583878 0.0216257 -0.0101448 0.0354015 -0.0032349 0.0650732 0.0556637 -0.060846 -0.0890207 -0.0164265 0.0081697 -0.0688958 -0.057503 -0.0781214 -0.0972038 0.0850402 -0.0176584 -0.013526 0.0176314 -0.1222397 0.0010536 -0.0189685 -0.0011189 0.1470894 0.0850408 0.0176594 -0.013525 -0.0176297 -0.1222379 -0.001077 -0.0189709 0.0010966 0.1470896 -0.1035508 0.094641 -0.0366984 0.099215 0.0306362 0.0141182 -0.0374717 0.0124772 0.1535336 -0.1035531 -0.0946385 -0.036707 -0.0992128 0.0306376 -0.0141295 -0.0374793 -0.0124882 0.1535308 unknown
polarizability: 136.6669377|-0.0002909|110.0830584|5.1147527|0.0016027|73.6156533 unknown
InChI: InChI=1S/C11H12/c1-2-4-11-9-6-5-8(7-9)10(11)3-1/h1-4,8-9H,5-7H2
charge 0 multiplicity 1
23 atoms
C  -1.256826 -1.148012 -0.376382
C  -1.256824 1.148064 -0.376293
C  -1.778173 0.000063 -1.304449
C  -2.002587 -0.787614 0.964053
C  -2.002586 0.787564 0.964114
C  0.197034 -0.713193 -0.19431
C  0.197035 0.713228 -0.194254
C  1.383559 -1.433294 0.016152
C  1.383559 1.433311 0.01628
C  2.590862 -0.707333 0.204834
C  2.590861 0.70733 0.204899
H  -1.41291 -2.18309 -0.717465
H  -1.412906 2.183168 -0.717301
H  -1.304187 0.000101 -2.301132
H  -2.878964 0.00007 -1.410093
H  -1.488085 -1.211218 1.843335
H  -3.033352 -1.186517 0.945574
H  -3.033351 1.18647 0.945659
H  -1.488084 1.2111 1.843427
H  1.38927 -2.529674 0.026129
H  1.38927 2.529689 0.026353
H  3.533591 -1.247917 0.349178
H  3.533591 1.247903 0.349291
