program: Gaussian 09
title: 000138271
version: EM64L-G09RevD.01
frameworkgroup: C1[X(C8H16)]
method: RPBEPBE
basis: SDD
operation: Freq
keyword: #p
keyword: freq=noraman
keyword: PBEPBE/SDD
title: #p freq=noraman PBEPBE/SDD
converged: YES YES NO NO
title: Mulliken charges:
elementType: C C C C C C C C H H H H H H H H H H H H H H H H
charge: -0.509997 0.440593 -0.367329 -0.329267 -0.429167 -0.828074 -0.686963 -0.671920 0.188879 0.205639 0.205188 0.212750 0.210946 0.204338 0.202829 0.218798 0.222320 0.229524 0.210718 0.208259 0.216823 0.220819 0.213450 0.210842
chargesum: 0.00000
title: Mulliken charges with hydrogens summed into heavy atoms:
elementType: C C C C C C C C
charge: -0.115478 0.440593 0.050609 -0.118320 -0.022000 -0.157432 -0.051163 -0.026809
polarizability: 1.15821799e+02 7.20826019e+00 8.25888727e+01 -4.81953484e+00 -1.45157275e+00 6.94235798e+01
1716.lowfreq: -11.0404 0.0004 0.0005 0.0006 1.1983 5.6349 35.2810 60.4741 76.6686
frequency: 35.1748 60.2038 76.6606 98.3466 156.5029 197.2218 217.2452 224.8552 290.6938 318.5834 356.4100 444.9855 478.5354 566.6840 738.4370 744.8411 810.8356 849.4897 871.2051 890.2747 928.0487 986.1155 1027.6782 1030.4131 1055.2290 1067.6499 1090.7138 1100.4107 1139.9428 1216.8505 1230.5500 1254.4366 1279.4946 1283.4305 1304.8597 1337.6054 1367.0144 1385.3866 1386.9655 1394.1846 1456.7375 1460.9455 1471.6618 1474.1813 1474.6627 1475.2269 1477.7947 1484.5120 1486.2101 1686.8782 2942.8124 2960.2722 2965.3454 2970.8908 2975.3948 2979.8669 3008.0938 3032.1557 3034.1173 3035.9964 3059.9719 3069.5106 3071.2031 3072.7256 3080.1787 3089.0771
redmass: 2.3252 2.0821 1.9690 2.2010 1.1820 1.3272 2.1582 1.1164 2.2228 2.5492 2.2441 2.7019 2.3769 2.7570 1.2756 1.2863 1.5959 1.3862 1.6337 1.4460 1.8892 1.5480 1.4588 2.0652 2.5397 1.7961 1.6672 1.9692 2.0889 2.0243 1.3176 1.2258 1.4037 1.1154 1.4487 1.5303 1.3659 1.2069 1.2111 1.3028 1.0766 1.0766 1.0577 1.0440 1.0492 1.0468 1.0595 1.0713 1.0804 6.9324 1.0626 1.0652 1.0394 1.0353 1.0353 1.0598 1.0957 1.0919 1.0970 1.1013 1.0906 1.1011 1.0994 1.0985 1.1006 1.0958
irintensity: 0.1647 0.0243 0.0134 1.0413 0.0878 0.0997 0.0102 0.0249 0.1828 0.4568 0.7267 2.0875 3.7543 5.9836 1.8613 14.7970 3.1592 9.9782 14.0244 1.4084 2.3707 6.1739 1.3328 2.0384 1.1502 4.8295 14.3391 4.8366 5.3181 5.0625 0.1329 3.2782 2.4298 0.1479 0.3956 0.5213 0.5082 9.8129 8.1698 24.2106 2.2871 6.6428 10.8670 12.6983 3.8869 8.9218 7.3984 14.1266 17.1967 3.1822 33.8315 38.2973 33.3616 49.8594 42.3869 33.7845 8.3196 6.5664 31.5460 13.7885 11.0496 75.0069 50.7194 82.3893 64.3323 42.3768
temp: 298.150 k
press: 1.00000 atm
elementType: 6 6 6 6 6 6 6 6 1 1 1 1 1 1 1 1 1 1 1 1 1 1 1 1
symmnumber: 1
zpe: 571758.7 jmol-1
zpe.correction: 0.217771 hartree
zpe.thermalcorrener: 0.228834 hartree
zpe.thermalcorrenthalpy: 0.229778 hartree
zpe.thermalcorrgfe: 0.180505 hartree
zpe.sumelectzpe: -313.762850 hartree
zpe.sumelectthermal: -313.751787 hartree
zpe.sumelectthermalent: -313.750843 hartree
zpe.sumelectthermalfe: -313.800117 hartree
dipole: 0.1394 0.2544 0.0616
dipole: 0.2965
quadrupole: -51.7257 -51.0454 -53.4931
quadrupole: 0.1752 -0.9274 -0.4526
quadrupole: 0.3624 1.0427 -1.4051 0.1752 -0.9274 -0.4526
hfenergy: -313.9806213 hartree
pointgroup: C01 [X(C8H16)]
dipole: -0.0529939 0.0931076 -0.0461868 debye
dipolederiv: -0.0673291 -0.0498871 -0.008889 0.0092328 0.0743136 0.0373387 -0.0590338 0.0647185 0.1352758 0.1676926 -0.0120698 -0.0826478 -0.0520422 0.2508823 -0.0664387 -0.1105858 -0.0941752 -0.1093616 0.0453766 -0.0192941 -0.0019633 -0.0604278 0.1534077 0.033619 0.0968094 0.0232675 0.0836308 0.0192786 -0.018902 -0.1133303 0.0732276 -0.0114419 -0.0542189 -0.1736357 -0.026487 -0.2487153 -0.0118279 -0.0049634 0.0168035 0.0735146 0.0996713 0.036159 0.0289942 0.0553838 0.1476237 -0.0355086 -0.0007858 0.0257747 -0.0291553 -0.134507 0.0637912 0.0293521 0.0798736 0.0799557 -0.0795091 -0.0441 0.0217794 -0.0292992 0.0783749 0.0153588 -0.0385054 0.0166282 0.0727818 -0.0162478 0.0335043 -0.0480979 -0.029069 0.1017937 0.0217988 0.0154832 0.0014386 0.0282178 -0.033791 0.0382312 0.0683011 0.0352372 0.0116987 -0.1267899 0.086386 -0.0924136 -0.1122238 0.0368821 0.0253112 -0.0194368 -0.0155574 -0.1644599 0.0928108 -0.0121393 0.0456219 0.0440231 0.051147 0.0024679 -0.0068245 0.0167952 -0.1756383 0.0883564 -0.0100148 0.0601607 0.0401943 0.0206836 0.0272063 0.0729942 0.0149638 0.0248462 -0.103577 0.0347321 -0.0807625 -0.123504 0.0295218 -0.0323543 0.0394108 -0.0482331 -0.1435746 0.0676014 0.0585117 0.0682012 0.1133334 -0.0435603 0.0408661 0.0327753 0.0210036 0.0364071 -0.1192191 0.0693301 -0.0983534 -0.1310778 0.0410477 -0.0040569 -0.0122402 -0.0575587 -0.1609778 0.0834754 -0.024416 0.0510451 0.0566327 0.0507535 0.0836412 0.0913595 0.0849116 -0.0095341 -0.0576693 0.0953378 -0.1266996 -0.0462895 -0.1257109 -0.1411342 0.0345949 -0.0812192 0.0586481 0.0161029 0.0345705 0.0193455 0.0895018 0.0290479 0.0576468 -0.1175098 0.0694474 0.0334798 0.0186461 -0.1321785 0.070303 -0.0570718 0.0709772 0.0505357 -0.0043178 -0.0222298 -0.1694857 0.0679572 0.0278697 0.0661335 0.0718177 0.0584072 0.006385 0.0453051 0.0391182 0.0179572 -0.1183071 0.1088488 -0.095477 -0.1074501 -0.1491443 -0.0034006 -0.1175326 0.0035013 0.0923052 0.0230617 -0.1534662 0.0135222 -0.0266268 0.0947665 0.0272388 0.0327539 0.0075014 0.0241501 -0.1140812 -0.0271249 -0.0881471 -0.1175506 -0.2470374 -0.0072327 0.054783 -0.0349891 0.0844963 0.024761 0.0759671 0.025054 0.0527876 0.0940841 -0.0548533 -0.0038455 0.0113262 -0.1728128 0.0694628 -0.0210927 0.0418179 0.0640951 unknown
polarizability: 115.7032524|-8.4651179|82.7878409|-2.4591225|-1.5618283|69.3431581 unknown
InChI: InChI=1S/C8H16/c1-4-6-8(3)7-5-2/h6H,4-5,7H2,1-3H3
charge 0 multiplicity 1
24 atoms
C  -1.2754 -0.127215 0.587651
C  0.073922 0.393802 0.099038
C  -2.426694 0.007581 -0.447406
C  1.13263 -0.45765 -0.037564
C  2.542945 -0.14772 -0.499463
C  0.126467 1.881969 -0.207759
C  -3.761219 -0.5536 0.089547
C  3.610735 -0.593311 0.533865
H  -1.575566 0.423795 1.505845
H  -1.181098 -1.193661 0.873471
H  -2.5613 1.072367 -0.721226
H  -2.13987 -0.52453 -1.375868
H  0.964693 -1.516043 0.223791
H  2.737062 -0.677583 -1.456142
H  2.664966 0.929584 -0.715101
H  -0.327333 2.464163 0.618372
H  1.153853 2.251258 -0.360039
H  -0.451801 2.124143 -1.121154
H  -3.668034 -1.627275 0.340262
H  -4.072742 -0.021197 1.008362
H  -4.5727 -0.449145 -0.653982
H  3.483851 -0.050804 1.488082
H  4.633436 -0.401816 0.159092
H  3.524699 -1.675114 0.748526
