program: Gaussian 09
title: 000138270
version: EM64L-G09RevD.01
frameworkgroup: C1[X(C10H20)]
method: RPBEPBE
basis: SDD
operation: Freq
keyword: #p
keyword: freq=noraman
keyword: PBEPBE/SDD
title: #p freq=noraman PBEPBE/SDD
converged: YES YES NO NO
title: Mulliken charges:
elementType: C C C C C C C C C C H H H H H H H H H H H H H H H H H H H H
charge: 0.510635 -0.562976 -0.548069 -0.364312 -0.367514 -0.353830 -0.443351 -0.679650 -0.687926 -0.673143 0.205980 0.197326 0.192211 0.203348 0.203384 0.196733 0.202525 0.212012 0.213011 0.210490 0.204350 0.210579 0.231292 0.203107 0.210013 0.219427 0.209967 0.211926 0.213341 0.219115
chargesum: 0.00000
title: Mulliken charges with hydrogens summed into heavy atoms:
elementType: C C C C C C C C C C
charge: 0.510635 -0.159670 -0.152510 0.035804 0.047023 -0.140819 -0.028512 -0.034672 -0.048519 -0.028761
polarizability: 1.16349309e+02 5.66480827e+00 1.25100166e+02 2.53407628e+00 1.73660304e+00 8.94465963e+01
1716.lowfreq: -1.8617 -0.0009 -0.0006 -0.0005 3.5027 16.8061 34.7246 47.1619 52.0800
frequency: 34.4132 47.1388 51.7890 72.6439 79.9823 141.2026 167.3571 190.5201 204.4099 220.8492 243.5419 298.2181 337.0930 360.4318 400.8144 452.4317 498.1750 618.1084 733.8830 750.8180 781.6120 806.9398 851.2963 867.5262 875.2899 880.9833 898.2677 926.7298 1016.5199 1027.7866 1051.2280 1064.3514 1068.1056 1078.3376 1091.5371 1098.6381 1140.4767 1202.3351 1217.4794 1234.2808 1254.6327 1256.5652 1271.6446 1286.2483 1307.5133 1315.9030 1333.5195 1337.5822 1365.4417 1384.9027 1386.2440 1387.3064 1460.6756 1464.3892 1468.8954 1471.5423 1473.5907 1474.8216 1475.3915 1480.0040 1483.6026 1485.4854 1497.2432 1677.6246 2954.6971 2964.3464 2968.6238 2971.3481 2972.4812 2974.6361 2976.6396 2980.9847 3013.6983 3014.8044 3027.7526 3032.2725 3038.8471 3062.3921 3067.6783 3068.8960 3070.8730 3072.8018 3077.8268 3079.5674
redmass: 2.5664 2.4853 2.4934 2.6818 1.6695 1.6150 2.5990 1.8492 1.3275 1.1553 1.4896 2.0941 2.3966 2.0989 2.8125 2.2650 2.4987 2.7756 1.2859 1.3079 1.2566 1.7003 1.8085 1.5036 1.3693 1.6058 1.6635 1.7709 1.7316 2.0881 2.4661 1.5158 1.7122 2.4261 1.9427 1.7834 2.1385 2.0026 1.2614 1.3360 1.2363 1.2261 1.2866 1.1009 1.3883 1.4632 1.4244 1.4189 1.5272 1.2258 1.2199 1.2168 1.0882 1.0839 1.0689 1.0543 1.0437 1.0435 1.0519 1.0583 1.0708 1.0599 1.0934 7.3744 1.0605 1.0651 1.0537 1.0411 1.0412 1.0364 1.0546 1.0608 1.0976 1.0996 1.1006 1.0931 1.1014 1.0917 1.0994 1.1012 1.0992 1.0982 1.0999 1.1002
irintensity: 0.0078 0.0440 0.0656 0.1303 0.0441 0.3898 0.0905 0.1148 0.3857 0.0100 0.3751 0.0368 0.6556 0.6377 0.8344 0.6619 3.3754 7.4824 4.7299 6.4661 13.6507 5.4801 11.4637 1.2981 1.5112 1.2740 21.7128 1.6690 1.2093 1.1272 0.5636 0.5979 10.3698 0.6962 11.2808 4.1440 2.5279 1.7488 0.5282 1.6666 4.6273 1.9111 1.0940 0.9830 0.3601 2.3369 1.6396 0.8022 2.2681 9.2440 19.9499 9.2851 3.4986 1.6939 3.1375 1.1493 8.4006 9.9570 20.8823 7.5478 23.5381 1.8888 15.6677 1.7581 31.5968 39.9242 5.3757 31.6753 65.5085 48.5200 19.6680 50.7559 2.6626 22.1877 45.5957 8.9713 17.3821 9.6899 47.4474 71.3314 52.3190 112.8430 43.1059 68.0654
temp: 298.150 k
press: 1.00000 atm
elementType: 6 6 6 6 6 6 6 6 6 6 1 1 1 1 1 1 1 1 1 1 1 1 1 1 1 1 1 1 1 1
symmnumber: 1
zpe: 719407.1 jmol-1
zpe.correction: 0.274008 hartree
zpe.thermalcorrener: 0.287650 hartree
zpe.thermalcorrenthalpy: 0.288594 hartree
zpe.thermalcorrgfe: 0.232664 hartree
zpe.sumelectzpe: -392.207302 hartree
zpe.sumelectthermal: -392.193660 hartree
zpe.sumelectthermalent: -392.192715 hartree
zpe.sumelectthermalfe: -392.248646 hartree
dipole: -0.2605 -0.0972 -0.0559
dipole: 0.2836
quadrupole: -65.9873 -63.7228 -66.2480
quadrupole: -0.1201 1.2095 -0.1302
quadrupole: -0.6679 1.5966 -0.9287 -0.1201 1.2095 -0.1302
hfenergy: -392.4813096 hartree
pointgroup: C01 [X(C10H20)]
dipole: 0.0859062 -0.0702612 -0.0113862 debye
polarizability: 128.0101186|0.9053294|113.7125819|-0.2224092|-0.3095115|89.1733705 unknown
InChI: InChI=1S/C10H20/c1-4-7-10(8-5-2)9-6-3/h7H,4-6,8-9H2,1-3H3
charge 0 multiplicity 1
30 atoms
C  0.094975 0.203036 0.300005
C  0.878597 1.415677 0.797549
C  0.908709 -0.858343 -0.434799
C  1.276968 2.418115 -0.327456
C  1.525649 -1.912999 0.528089
C  -1.244017 0.090039 0.543905
C  -2.174564 -1.030444 0.12176
C  0.067943 3.147455 -0.950325
C  2.419156 -2.93544 -0.206104
C  -3.340091 -0.523234 -0.768485
H  0.286234 1.961067 1.558785
H  1.806707 1.070438 1.300185
H  1.735422 -0.374762 -0.994277
H  0.292367 -1.387313 -1.187133
H  1.978832 3.163089 0.098056
H  1.835988 1.881667 -1.120231
H  2.116479 -1.394012 1.309171
H  0.705328 -2.436954 1.056654
H  -1.730642 0.904327 1.106247
H  -1.619294 -1.824478 -0.41084
H  -2.605403 -1.506992 1.027393
H  0.38565 3.830697 -1.759611
H  -0.654463 2.425307 -1.371451
H  -0.464995 3.748536 -0.188929
H  1.845494 -3.481545 -0.97902
H  2.838001 -3.681927 0.493698
H  3.265874 -2.433099 -0.711361
H  -3.92002 0.262136 -0.248433
H  -4.034426 -1.344892 -1.025226
H  -2.954558 -0.088353 -1.708416
