program: Gaussian 09
title: 000138265
version: EM64L-G09RevD.01
frameworkgroup: C1[X(C10H15NO)]
method: RPBEPBE
basis: SDD
operation: Freq
keyword: #p
keyword: freq=noraman
keyword: PBEPBE/SDD
title: #p freq=noraman PBEPBE/SDD
converged: YES YES NO NO
title: Mulliken charges:
elementType: O N C C C C C C C C C C H H H H H H H H H H H H H H H
charge: -0.313701 -0.689041 -0.386654 -0.342071 -0.277638 -0.686596 0.253152 0.273460 -0.323055 -0.378109 -0.278158 -0.221698 0.207468 0.207434 0.194519 0.194657 0.201767 0.201512 0.211751 0.211783 0.218092 0.239700 0.214767 0.219050 0.217061 0.298266 0.332283
chargesum: 0.00000
title: Mulliken charges with hydrogens summed into heavy atoms:
elementType: O N C C C C C C C C C C
charge: -0.313701 -0.058491 0.028248 0.047104 0.125641 -0.044970 0.253152 0.273460 -0.083355 -0.163342 -0.059108 -0.004637
polarizability: 1.62370040e+02 -5.85479193e+00 1.30162401e+02 2.29558756e-02 1.50238178e-03 6.78265274e+01
1716.lowfreq: -0.0008 0.0005 0.0008 8.4560 9.8605 19.3135 41.4497 69.6230 72.9185
frequency: 41.4182 69.3609 72.8801 107.9334 143.1962 185.5336 198.5363 226.1834 235.8867 281.2935 334.3570 358.8391 402.8102 443.5096 475.8376 506.0595 532.3461 561.2491 591.9765 722.7102 734.0212 745.6335 760.3602 814.9207 828.7495 832.4579 894.6901 903.2853 943.2098 948.2948 978.1327 1009.9227 1041.7497 1049.2763 1083.8043 1123.5366 1131.6114 1147.8578 1168.3867 1193.5051 1214.6662 1275.1423 1281.6441 1286.7878 1289.0264 1321.1828 1349.7869 1380.1167 1391.3606 1411.3258 1449.1652 1471.5861 1474.6686 1476.6025 1483.8399 1492.5132 1513.5491 1596.6928 1601.8162 1629.8669 2944.2383 2969.0610 2975.9537 2991.9461 2999.0876 3012.7346 3056.5819 3074.3620 3076.4304 3118.3082 3135.4614 3149.2336 3167.6331 3568.0224 3716.8050
redmass: 4.1869 1.6652 3.7942 2.8013 1.9266 4.7591 3.4156 1.1358 4.2693 2.7555 1.3868 3.3476 3.0101 2.5297 1.1320 3.7813 6.0856 3.9279 6.9428 3.7372 1.2417 1.0811 5.6548 1.1967 1.3764 5.3166 1.3717 1.7914 1.1702 1.2610 6.5237 1.7946 2.8853 2.0289 2.1996 2.6128 1.4605 1.4550 1.0787 3.5829 1.3643 1.3003 1.1602 1.6960 1.0769 1.9904 1.4671 1.4420 1.2381 6.0513 2.6237 1.0759 1.0667 1.0422 1.0906 1.1152 3.0126 3.8344 1.8845 2.8258 1.0551 1.0588 1.0365 1.0591 1.1055 1.1011 1.1044 1.1014 1.0994 1.0866 1.0881 1.0929 1.0997 1.0441 1.1046
irintensity: 0.2168 0.6818 0.2862 1.8686 3.1397 1.1071 2.3213 0.1851 0.0019 45.5606 195.5483 5.6950 1.1374 10.7549 61.1692 4.9663 1.1549 1.4348 3.5013 2.8937 120.3534 1.5430 15.1799 1.4939 0.5436 3.1144 5.1733 18.4983 0.1350 0.3585 49.8511 2.0319 30.2628 9.4305 9.2213 2.0603 87.9682 1.5582 7.5582 220.7532 0.0014 2.8850 0.4038 9.8543 0.1006 52.2386 0.2123 22.1859 4.0634 2.0030 12.0660 2.0775 0.0740 13.0784 20.1566 31.4068 139.9208 13.8072 17.0326 221.3045 32.8175 32.3228 33.1142 42.3806 26.8436 3.1463 24.4033 103.4910 49.5733 13.6524 8.3503 42.3379 16.6619 65.0580 35.7952
temp: 298.150 k
press: 1.00000 atm
elementType: 8 7 6 6 6 6 6 6 6 6 6 6 1 1 1 1 1 1 1 1 1 1 1 1 1 1 1
symmnumber: 1
zpe: 605146.1 jmol-1
zpe.correction: 0.230488 hartree
zpe.thermalcorrener: 0.243288 hartree
zpe.thermalcorrenthalpy: 0.244232 hartree
zpe.thermalcorrgfe: 0.190988 hartree
zpe.sumelectzpe: -519.113384 hartree
zpe.sumelectthermal: -519.100584 hartree
zpe.sumelectthermalent: -519.099640 hartree
zpe.sumelectthermalfe: -519.152884 hartree
dipole: -1.8338 0.7412 -0.0009
dipole: 1.9779
quadrupole: -67.0821 -63.5160 -77.7888
quadrupole: 5.2941 -0.0031 -0.0123
quadrupole: 2.3802 5.9463 -8.3265 5.2941 -0.0031 -0.0123
hfenergy: -519.343872 hartree
pointgroup: C01 [X(C10H15N1O1)]
dipole: 0.7227998 -0.2880503 0.0126095 debye
polarizability: 162.4090285|-5.686621|130.0967043|1.2849363|-0.8343979|67.853235 unknown
InChI: InChI=1S/C10H15NO/c1-2-3-8-12-10-7-5-4-6-9(10)11/h4-7H,2-3,8,11H2,1H3
charge 0 multiplicity 1
27 atoms
O  0.45927 -0.504797 0.079782
N  -1.459755 -2.354269 0.079015
C  2.872538 -0.320578 0.11153
C  4.109829 0.607563 0.114492
C  1.561526 0.468791 0.084779
C  5.4367 -0.181029 0.143911
C  -0.862364 0.000113 0.057012
C  -1.866082 -1.022094 0.056983
C  -1.213688 1.362714 0.036096
C  -3.227578 -0.62522 0.035343
C  -2.581024 1.740606 0.014523
C  -3.580216 0.744472 0.014422
H  2.907374 -0.99055 -0.769353
H  2.885798 -0.967322 1.010174
H  4.062731 1.283948 0.992246
H  4.08628 1.257903 -0.783626
H  1.473384 1.123033 0.977868
H  1.499063 1.10387 -0.824203
H  5.499629 -0.816694 1.04695
H  5.524376 -0.841949 -0.738701
H  6.308743 0.497917 0.146357
H  -0.439574 2.136552 0.036225
H  -4.008702 -1.395427 0.035317
H  -2.851534 2.801363 -0.001744
H  -4.638583 1.027547 -0.002062
H  -2.137559 -3.108915 0.077703
H  -0.465381 -2.562549 0.093763
