program: Gaussian 09
title: 000138262
version: EM64L-G09RevD.01
frameworkgroup: C1[X(C21H16)]
method: RPBEPBE
basis: SDD
operation: Freq
keyword: #p
keyword: freq=noraman
keyword: PBEPBE/SDD
title: #p freq=noraman PBEPBE/SDD
converged: YES YES NO NO
title: Mulliken charges:
elementType: C C C C C C C C C C C C C C C C C C C C C H H H H H H H H H H H H H H H H
charge: -0.461448 0.272715 0.115752 0.246389 -0.479692 0.548918 -0.426519 0.333856 -0.379506 -0.458816 -0.379239 -0.234724 -0.251421 -0.410115 -0.402366 -0.223842 -0.229790 -0.248212 -0.241022 -0.234726 -0.242732 0.237783 0.270088 0.247582 0.255094 0.229375 0.243293 0.225032 0.224509 0.252609 0.241553 0.225160 0.224663 0.228062 0.226675 0.225576 0.229486
chargesum: 0.00000
title: Mulliken charges with hydrogens summed into heavy atoms:
elementType: C C C C C C C C C C C C C C C C C C C C C
charge: -0.223665 0.272715 0.115752 0.246389 -0.209605 0.548918 -0.178937 0.333856 -0.124412 -0.229440 -0.135946 -0.009692 -0.026912 -0.157506 -0.160813 0.001318 -0.005127 -0.020150 -0.014347 -0.009150 -0.013247
polarizability: 3.02836416e+02 -2.58826651e+00 2.08961607e+02 2.15386308e+01 1.71151270e+01 1.61993408e+02
1716.lowfreq: -4.3528 -2.2268 -0.0005 -0.0002 0.0007 7.4225 20.1904 35.7890 45.8934
frequency: 20.0666 35.7838 45.8821 63.5102 85.0848 94.9857 180.5980 196.0052 230.2106 243.5118 257.2771 307.4840 359.2556 403.4024 405.5737 413.4173 437.5282 462.6806 499.5668 565.6310 580.9632 595.3187 612.6184 615.6911 627.1817 641.8631 691.5910 704.3716 704.9873 731.7155 738.7502 762.1140 771.4127 778.9500 801.5471 851.9984 854.6571 858.5481 873.5342 886.8829 920.6079 925.4439 937.8064 950.6106 975.4362 977.7046 985.4409 989.4389 990.6644 994.6315 995.2871 1016.7424 1024.5999 1027.5773 1031.9233 1078.0888 1078.8398 1085.4894 1142.5917 1164.9544 1171.3848 1172.7548 1179.5776 1187.1694 1190.9763 1196.0792 1197.5513 1222.4906 1267.5827 1283.1239 1308.8697 1330.3498 1335.8680 1373.2584 1381.9045 1397.6984 1434.4140 1440.9726 1445.9131 1457.5038 1480.9391 1482.2226 1575.0153 1580.8872 1592.7485 1600.5757 1610.2032 1614.7554 1617.0945 2948.5693 3113.1173 3121.8747 3122.5376 3122.8698 3128.8970 3132.9312 3133.8185 3141.8867 3144.5794 3147.0614 3151.5851 3161.9223 3162.1901 3165.2303 3176.7843
redmass: 3.7814 5.1581 4.1221 4.6520 4.3608 4.4293 4.4560 4.4010 4.2795 4.6974 5.6802 4.3731 5.2885 2.8090 2.8770 3.2863 3.5956 4.2140 3.5985 5.2664 3.5461 5.9790 5.5451 6.3049 4.9233 3.9535 3.9864 1.7254 1.8294 4.3893 2.5304 1.9234 1.7703 1.8526 2.4795 1.3085 1.2790 1.5658 3.6450 1.5877 1.4737 1.5342 4.4178 1.4521 1.3890 1.4262 1.4529 3.9003 6.0153 1.3242 1.3205 2.4371 2.1194 2.0872 1.9333 1.8698 1.6015 2.1970 1.6979 1.2716 1.0588 1.0541 1.4138 1.1127 1.1283 2.3772 1.3681 2.0139 2.1719 1.5548 1.7551 1.2999 2.3588 6.5860 8.2923 5.4148 2.2930 2.1872 2.4538 3.0878 2.3386 2.3991 6.1973 6.1064 6.1408 7.4784 6.3511 6.6345 6.6709 1.0808 1.0874 1.0860 1.0849 1.0849 1.0876 1.0898 1.0913 1.0925 1.0961 1.0946 1.0958 1.1002 1.1013 1.1013 1.0953
irintensity: 0.0042 0.1056 0.1153 0.2140 0.2758 0.3860 1.0061 1.6957 1.3623 1.2442 0.8669 0.1138 0.4150 0.1080 0.7356 3.3344 1.4417 2.4248 8.2050 7.9880 14.0431 6.6743 1.6989 1.3036 0.2071 12.6652 7.7866 50.2304 39.7608 2.7924 24.6465 43.2305 29.5101 81.5560 18.5317 2.1433 2.1672 7.5082 4.8357 6.3224 5.0660 1.2485 5.1902 1.6912 0.1228 1.3513 0.2007 0.0077 1.1578 0.1853 0.2889 5.7166 7.1084 14.2762 6.6913 4.6255 12.4111 7.4319 0.3954 1.1213 0.1585 0.0108 2.4343 1.5697 0.6384 0.8732 0.5765 2.3408 0.5509 0.3066 8.3056 2.7443 13.1034 0.5501 0.3081 4.5655 11.6741 8.9604 4.9597 11.4212 37.0961 8.6977 1.9616 1.1287 2.6105 2.1168 18.3848 4.5745 1.5316 10.4461 8.8574 1.3109 3.7879 1.1378 0.4902 11.1389 12.9343 32.6660 39.5616 29.2408 21.3207 39.8897 24.8140 21.3673 5.8075
temp: 298.150 k
press: 1.00000 atm
elementType: 6 6 6 6 6 6 6 6 6 6 6 6 6 6 6 6 6 6 6 6 6 1 1 1 1 1 1 1 1 1 1 1 1 1 1 1 1
symmnumber: 1
zpe: 780514.1 jmol-1
zpe.correction: 0.297282 hartree
zpe.thermalcorrener: 0.313383 hartree
zpe.thermalcorrenthalpy: 0.314327 hartree
zpe.thermalcorrgfe: 0.251657 hartree
zpe.sumelectzpe: -808.421625 hartree
zpe.sumelectthermal: -808.405524 hartree
zpe.sumelectthermalent: -808.404580 hartree
zpe.sumelectthermalfe: -808.467251 hartree
dipole: -0.1061 -0.2764 -0.0871
dipole: 0.3086
quadrupole: -107.5521 -118.4912 -116.5690
quadrupole: -1.0721 4.7251 3.6699
quadrupole: 6.6520 -4.2871 -2.3649 -1.0721 4.7251 3.6699
hfenergy: -808.7189074 hartree
pointgroup: C01 [X(C21H16)]
dipole: 0.0381335 -0.0956326 0.0643503 debye
polarizability: 302.2707951|6.6767337|195.6419045|22.0844011|-27.408715|175.8787315 unknown
InChI: InChI=1S/C21H16/c1-3-9-16(10-4-1)20-15-21(17-11-5-2-6-12-17)19-14-8-7-13-18(19)20/h1-15,20H
charge 0 multiplicity 1
37 atoms
C  1.220913 0.18434 1.022431
C  0.846714 1.372565 0.131125
C  -0.53524 1.288147 -0.217165
C  -1.094715 0.043123 0.379008
C  -0.092054 -0.587871 1.082039
C  2.427784 -0.632138 0.550535
C  1.638609 2.448809 -0.298056
C  -2.488411 -0.442213 0.236137
C  -1.138467 2.320395 -0.972116
C  3.621283 -0.663649 1.312754
C  2.374585 -1.360558 -0.666385
C  1.037704 3.469875 -1.078492
C  -0.340142 3.408332 -1.400698
C  -3.190717 -0.322792 -0.995872
C  -3.148806 -1.069886 1.329114
C  4.742666 -1.404173 0.871144
C  3.491203 -2.100524 -1.109425
C  4.681107 -2.125046 -0.342196
C  -4.505282 -0.819413 -1.12999
C  -4.462551 -1.56635 1.195448
C  -5.149078 -1.44146 -0.035332
H  1.458137 0.571747 2.037989
H  -0.179582 -1.548679 1.595564
H  2.702984 2.498362 -0.041131
H  -2.206981 2.296729 -1.209174
H  3.673377 -0.107783 2.257696
H  1.453549 -1.342877 -1.261224
H  1.640261 4.315374 -1.428984
H  -0.79407 4.214241 -1.988649
H  -2.690992 0.124474 -1.861822
H  -2.629773 -1.14663 2.291521
H  5.658668 -1.419116 1.47269
H  3.43675 -2.658774 -2.051082
H  5.547525 -2.700775 -0.68667
H  -5.024912 -0.726544 -2.090405
H  -4.954287 -2.042067 2.051521
H  -6.171064 -1.822595 -0.139148
