program: Gaussian 09
title: 000138261
version: EM64L-G09RevD.01
frameworkgroup: C1[X(C6H6O3)]
method: RPBEPBE
basis: SDD
operation: Freq
keyword: #p
keyword: freq=noraman
keyword: PBEPBE/SDD
title: #p freq=noraman PBEPBE/SDD
converged: YES YES NO NO
title: Mulliken charges:
elementType: O O O C C C C C C H H H H H H
charge: -0.211193 -0.157810 -0.156207 -0.243774 -0.279825 -0.449580 -0.454681 0.176038 0.189095 0.291670 0.296334 0.261065 0.234352 0.251718 0.252796
chargesum: 0.00000
title: Mulliken charges with hydrogens summed into heavy atoms:
elementType: O O O C C C C C C
charge: -0.211193 -0.157810 -0.156207 0.047895 0.016510 0.045837 0.049834 0.176038 0.189095
polarizability: 8.31857052e+01 -2.56538619e+00 6.76449874e+01 2.09065367e-02 1.02475968e+00 4.79669852e+01
1716.lowfreq: -13.6768 -11.2804 -0.0008 0.0007 0.0008 13.2850 56.1409 128.2807 210.1634
frequency: 56.0181 128.2798 210.1596 222.5061 362.5841 471.1881 568.3556 577.2277 660.1004 673.3258 716.3693 779.5761 784.1461 820.2959 841.9106 910.1673 968.7782 974.9629 984.7625 1070.1056 1080.6373 1140.0661 1176.9523 1186.5090 1196.1396 1238.4383 1246.4167 1253.7313 1279.6578 1464.3323 1475.6571 1700.8901 1767.1480 3040.8109 3047.1056 3078.3861 3097.1108 3108.3871 3128.1572
redmass: 2.6283 15.8463 2.7385 4.3717 11.1114 5.6971 11.5734 5.6477 6.1386 7.0366 1.8943 4.4945 1.9544 4.6639 2.6209 1.7533 3.3261 2.2288 2.9545 1.8143 2.0141 3.9584 1.4591 1.4216 1.2970 1.4316 1.4048 1.4962 1.5600 1.0798 1.0992 12.7798 12.6605 1.0578 1.0635 1.0878 1.0923 1.1056 1.1066
irintensity: 0.0696 2.0991 0.8049 4.9117 8.2967 3.5108 4.7320 47.9627 3.3365 4.9788 7.5251 53.1612 19.1948 115.4985 188.5178 9.2320 19.3917 9.4820 13.9110 61.0907 58.1735 63.4122 16.8133 1.6371 7.6583 3.4854 0.4228 10.2567 3.6151 12.6018 6.2997 509.6510 104.0677 22.1642 26.5684 5.6224 3.8294 1.2533 26.3727
temp: 298.150 k
press: 1.00000 atm
elementType: 8 8 8 6 6 6 6 6 6 1 1 1 1 1 1
symmnumber: 1
zpe: 290018.8 jmol-1
zpe.correction: 0.110462 hartree
zpe.thermalcorrener: 0.117854 hartree
zpe.thermalcorrenthalpy: 0.118798 hartree
zpe.thermalcorrgfe: 0.077879 hartree
zpe.sumelectzpe: -457.223634 hartree
zpe.sumelectthermal: -457.216242 hartree
zpe.sumelectthermalent: -457.215298 hartree
zpe.sumelectthermalfe: -457.256217 hartree
dipole: 1.2519 5.3577 1.7108
dipole: 5.7618
quadrupole: -63.6399 -54.6687 -47.7109
quadrupole: 1.8368 -0.0480 -1.5813
quadrupole: -8.3000 0.6711 7.6289 1.8368 -0.0480 -1.5813
hfenergy: -457.3340958 hartree
pointgroup: C01 [X(C6H6O3)]
dipole: 0.2748087 2.1415152 0.690748 debye
dipolederiv: -1.8277135 0.1285229 0.0637744 0.1279762 -0.5389024 -0.1125241 0.0569741 -0.1891216 -0.233143 -1.0396663 0.2611058 0.0498799 0.3021402 -0.593766 -0.0707781 0.1368008 -0.1492214 -0.3384799 -1.1652306 -0.1613691 0.0362872 -0.2063859 -0.4990952 -0.0273491 -0.0621302 -0.0955627 -0.3123289 -0.0352127 -0.0360818 0.0623672 0.0093299 -0.3989671 -0.0924881 0.023612 -0.0581686 0.0667374 -0.0835706 -0.0884766 -0.0433119 -0.1284445 -0.3927159 -0.0139695 0.0026993 0.0393952 0.0632435 0.0362043 -0.00171 -0.017814 0.0269553 0.1632548 0.0355653 -0.0379246 -0.0683297 0.1088313 0.0269538 0.0305176 -0.0188947 -0.008088 0.1759979 0.0321876 -0.0093102 -0.0940044 0.0847258 1.9601931 -0.2423073 -0.0388775 0.0972948 0.9552226 0.2219192 0.0767027 0.382286 0.312127 1.9653948 0.0903651 -0.0959232 -0.2588729 1.0049643 0.2007963 -0.1936526 0.3394213 0.2833767 0.0310173 0.0257543 -0.0725386 0.0119977 0.084661 0.0175088 -0.0735487 0.010111 -0.0193479 0.035247 0.0044723 0.0710802 0.0218384 0.0759365 -0.0290986 0.0652965 -0.0354015 -0.0137679 0.0025168 -0.0080189 0.0749325 0.0362724 0.0762496 -0.0334132 0.1018126 0.0184073 -0.0443593 0.0333338 -0.0582674 -0.031043 -0.080308 -0.0789966 -0.0591978 -0.0553259 -0.0655034 0.0344179 0.0248001 0.0656203 0.0143375 0.0817865 -0.1045473 -0.0126702 0.0347619 -0.0236924 0.0787995 0.0357327 -0.0101274 -0.0542561 -0.0334922 0.0707038 -0.0564885 -0.0667677 -0.0106152 -0.0708321 unknown
polarizability: 83.5026038|-0.674793|67.2349361|-1.5029877|1.2988695|48.0601379 unknown
InChI: InChI=1S/C6H6O3/c7-5-3-1-2-4(3)6(8)9-5/h3-4H,1-2H2
charge 0 multiplicity 1
15 atoms
O  -0.199865 -1.381171 -0.31353
O  2.138644 -1.342672 -0.27718
O  -2.464046 -0.868521 -0.015009
C  0.844926 0.579906 0.657013
C  -0.698965 0.781301 0.630667
C  1.034589 1.813225 -0.308713
C  -0.523483 1.908574 -0.47217
C  1.080434 -0.77432 0.000139
C  -1.289582 -0.516022 0.109253
H  1.377347 0.629872 1.618493
H  -1.204411 1.112432 1.548599
H  1.619189 1.619446 -1.221129
H  1.470286 2.679191 0.214587
H  -0.971311 2.874659 -0.195934
H  -0.898452 1.6174 -1.466687
