program: Gaussian 09
title: 000138260
version: EM64L-G09RevD.01
frameworkgroup: C1[X(C6H14O2)]
method: RPBEPBE
basis: SDD
operation: Freq
keyword: #pfreq=noraman
keyword: PBEPBE/SDD
title: #p freq=noraman PBEPBE/SDD
converged: YES YES NO NO
title: Mulliken charges:
elementType: O O C C C C C C H H H H H H H H H H H H H H
charge: -0.274434 -0.277458 -0.395034 0.048347 -0.338566 -0.693268 -0.502650 -0.510871 0.187371 0.210073 0.172634 0.228128 0.213381 0.217587 0.201971 0.207326 0.229076 0.192232 0.242106 0.236051 0.197661 0.208338
chargesum: 0.00000
title: Mulliken charges with hydrogens summed into heavy atoms:
elementType: O O C C C C C C
charge: -0.274434 -0.277458 0.002409 0.220981 0.102942 -0.066384 0.160765 0.131178
polarizability: 8.09473522e+01 -1.09294603e+00 7.60221687e+01 -5.02476320e-01 1.99305771e-01 6.30793172e+01
1716.lowfreq: -8.1174 -0.0005 0.0003 0.0006 3.2821 15.0531 51.4681 67.8364 97.5821
frequency: 51.4565 67.7893 97.5555 106.6901 148.9856 168.4062 209.9411 234.5618 275.5636 284.8991 320.5279 386.8082 504.6046 656.0940 740.3949 794.1129 825.4647 899.3896 927.2908 1003.3742 1013.1705 1051.1552 1084.1913 1109.5872 1113.1170 1118.2810 1132.0837 1151.5427 1171.1321 1229.9915 1287.2953 1289.7723 1330.5865 1340.5761 1365.5647 1389.4038 1426.4581 1434.8046 1450.5447 1452.5849 1464.0229 1475.3067 1477.8124 1479.0564 1480.7904 1488.9000 2842.5639 2925.3503 2945.1672 2967.4174 2979.5724 3001.5172 3004.0332 3028.1394 3046.3495 3056.7332 3069.6232 3077.4779 3098.7066 3117.7362
redmass: 2.6210 1.8579 2.2048 2.3130 1.3896 1.2273 1.8669 1.1907 2.9059 3.0193 3.0583 2.8610 4.6435 4.3561 1.2164 2.4626 2.0803 1.6181 2.0839 3.9994 5.4196 3.1111 1.9159 1.3075 1.3040 1.5706 1.9739 1.4967 1.8845 1.3042 1.1103 1.4889 1.4374 1.1702 1.5017 1.2162 1.1498 1.1388 1.0714 1.0527 1.0704 1.0492 1.0451 1.0441 1.0526 1.0875 1.0825 1.0352 1.0402 1.0360 1.0609 1.1011 1.0617 1.0974 1.1002 1.0915 1.0985 1.1028 1.0970 1.1027
irintensity: 2.8930 0.3111 2.3766 6.3090 1.5678 2.9632 9.6266 1.2949 1.8750 1.7793 0.5985 2.8601 4.2484 4.2314 0.2585 50.0160 15.9854 22.2488 3.6855 40.6274 139.9522 14.8509 30.2542 3.5358 5.2037 24.2724 46.3009 13.1869 26.0871 5.4189 1.7019 18.9782 20.5542 28.3470 0.7004 11.3196 8.1524 7.0062 2.4810 10.4216 13.7037 6.1293 11.4240 9.3986 11.0028 16.0983 94.3311 76.2841 82.0185 38.5656 38.8839 73.8863 22.4821 20.6030 1.7485 44.0156 54.0042 82.4928 28.7672 25.9176
temp: 298.150 k
press: 1.00000 atm
elementType: 8 8 6 6 6 6 6 6 1 1 1 1 1 1 1 1 1 1 1 1 1 1
symmnumber: 1
zpe: 506451.2 jmol-1
zpe.correction: 0.192897 hartree
zpe.thermalcorrener: 0.203836 hartree
zpe.thermalcorrenthalpy: 0.204780 hartree
zpe.thermalcorrgfe: 0.156102 hartree
zpe.sumelectzpe: -386.756578 hartree
zpe.sumelectthermal: -386.745639 hartree
zpe.sumelectthermalent: -386.744695 hartree
zpe.sumelectthermalfe: -386.793374 hartree
dipole: 1.1429 1.4886 1.5697
dipole: 2.4467
quadrupole: -47.0490 -47.8704 -51.5169
quadrupole: -0.5563 1.0167 1.1354
quadrupole: 1.7631 0.9417 -2.7048 -0.5563 1.0167 1.1354
hfenergy: -386.9494751 hartree
pointgroup: C01 [X(C6H14O2)]
dipole: -0.346839 -0.6314686 0.6383857 debye
dipolederiv: -0.9153883 0.2879997 -0.1106189 0.3184098 -0.7555437 0.0529923 -0.1962023 0.0861706 -0.460214 -0.5500905 -0.1074346 -0.0040552 -0.0167757 -1.1440182 -0.0361098 -0.0274071 -0.2640582 -0.4400415 -0.1909512 -0.0484944 -0.0102197 -0.032351 0.0598572 0.0087531 0.001586 -0.0129668 0.0367675 0.836047 -0.0206801 0.0196415 -0.3029251 1.2406027 -0.0041682 0.1318623 0.2791293 0.6496329 0.0491153 -0.0116622 -0.0124112 -0.0067119 0.1184644 0.0153678 -0.0605051 0.0036221 0.0550945 -0.0580431 -0.0287063 0.0030935 -0.0299672 0.1053617 0.0073321 0.032995 0.0158352 0.0748523 0.6461013 -0.1812799 0.0355666 -0.0092376 0.2294408 0.0101204 0.0236263 -0.0011361 0.3258928 0.3339402 -0.0081292 -0.040251 0.046117 0.6547702 -0.0511097 -0.0486681 -0.2024139 0.2506952 0.0060675 0.0839603 -0.0338401 0.07994 -0.1019321 0.1224356 0.0045937 0.0903975 0.0256305 0.0609375 -0.0455651 -0.0103561 -0.0373404 -0.0397954 -0.1391849 0.0141677 -0.1016719 -0.0632667 -0.1291916 -0.0678933 0.1591157 -0.0113488 -0.0874159 0.0925334 0.0727945 0.0210488 -0.1996844 0.0417574 0.0715316 -0.0336523 0.0568933 -0.0717661 0.0906167 -0.0274709 0.0675926 0.0411788 0.0615219 -0.0204447 -0.024898 -0.014801 -0.0237192 -0.1281058 -0.0129251 -0.099191 -0.0501629 -0.0506769 -0.0520788 0.1082095 -0.0584173 0.0734613 0.0600798 0.1528239 0.0694234 -0.0892851 0.015305 0.0577674 -0.0340774 0.1235595 -0.1211742 0.0855167 -0.0709513 0.0789446 0.0528947 0.0546953 -0.0075329 -0.0115801 -0.0488105 -0.0476391 -0.1348927 -0.0715775 -0.1478416 -0.0505052 0.0297669 0.0574463 -0.025939 0.1033819 -0.1129326 0.0747657 -0.035105 0.0678782 0.0926684 -0.0978697 0.0211234 0.051906 -0.0755593 0.079642 0.0689693 0.1545122 0.0364569 -0.1465186 -0.0115533 -0.006912 -0.038677 -0.1055428 0.0284462 -0.1250506 -0.0700233 -0.0903527 -0.0297323 0.0843501 -0.0561534 -0.0502495 -0.0358542 -0.0560484 -0.0885236 -0.0600045 -0.128692 -0.018013 -0.0460788 -0.0384383 0.1358161 0.0088131 -0.0035254 -0.007209 0.1652166 0.1318678 -0.1018021 -0.1697619 0.1215767 -0.0725233 0.0485281 -0.0245362 0.0248713 -0.0733379 0.0999572 0.0439182 unknown
polarizability: 81.1694024|-0.218443|75.7804076|0.5238593|-0.521533|63.0990282 unknown
InChI: InChI=1S/C6H14O2/c1-4-5-6(7-2)8-3/h6H,4-5H2,1-3H3
charge 0 multiplicity 1
22 atoms
O  -1.08543 1.14322 -0.020027
O  -0.768899 -1.134721 -0.520319
C  0.959439 0.152418 0.760603
C  -0.533815 -0.078617 0.491819
C  1.760291 0.560665 -0.495204
C  3.264034 0.734221 -0.194665
C  -2.538718 1.091485 -0.228656
C  -0.724377 -2.486519 0.033268
H  1.383974 -0.776981 1.192427
H  1.048323 0.936483 1.53827
H  -1.069602 -0.388981 1.427821
H  1.33949 1.501284 -0.894666
H  1.612552 -0.206307 -1.278898
H  3.820754 1.032135 -1.102217
H  3.710953 -0.207083 0.179723
H  3.432187 1.51336 0.573429
H  -2.829329 2.100503 -0.559078
H  -3.066122 0.842891 0.717209
H  -2.796701 0.344831 -0.999802
H  -1.038147 -3.160882 -0.779361
H  -1.41997 -2.599837 0.893339
H  0.297012 -2.769868 0.361883
