program: Gaussian 09
title: 000138259
version: EM64L-G09RevD.01
frameworkgroup: C1[X(C4F9I)]
method: RPBEPBE
basis: SDD
operation: Freq
keyword: #p
keyword: freq=noraman
keyword: PBEPBE/SDD
title: #p freq=noraman PBEPBE/SDD
converged: YES YES NO NO
title: Mulliken charges:
elementType: I F F F F F F F F F C C C C
charge: 0.351601 -0.124900 -0.119959 -0.124611 -0.120154 -0.124405 -0.125068 -0.125013 -0.120126 -0.124517 -0.697697 0.484729 0.485148 0.484975
chargesum: 0.00000
title: Mulliken charges with hydrogens summed into heavy atoms:
polarizability: 9.24287639e+01 1.18366097e-02 5.45412952e+01 -3.64255102e-02 7.45543350e-04 5.45286636e+01
1716.lowfreq: -8.3629 -0.0008 -0.0007 -0.0003 7.4826 9.1731 50.3453 70.2797 71.5021
frequency: 50.2888 70.2568 71.4932 120.7232 121.2333 157.5366 175.0599 175.9212 239.8394 265.4741 274.7942 275.2611 300.4732 300.7515 301.4674 458.0034 464.8298 465.2007 473.9387 494.8212 495.0969 623.9465 624.1036 658.8178 820.5545 868.9218 870.2246 980.4963 1010.2503 1010.6951 1086.3443 1086.9384 1105.5461 1126.1349 1151.1702 1152.2840
redmass: 19.0033 19.9500 19.9272 21.9169 21.8596 27.9159 18.7125 18.7174 21.8193 18.3951 18.3451 18.3420 18.4041 18.4520 18.4640 17.8193 17.8232 17.8269 17.8988 17.9314 17.9324 16.7690 16.7705 17.5099 13.1726 14.2044 14.2081 13.3739 13.1772 13.1784 12.8399 12.8412 12.7962 12.8009 12.3248 12.3212
irintensity: 0.0602 0.0250 0.0330 0.2654 0.2549 2.3042 0.2921 0.2764 0.0001 0.1363 0.9196 0.9065 0.0282 0.0217 0.0240 5.3629 6.8592 6.8519 1.9728 0.3427 0.3367 34.9359 35.0064 16.3211 76.9436 87.1806 87.9669 0.7856 30.7614 30.5840 0.8687 1.1245 383.7662 107.0018 517.2158 515.9651
temp: 298.150 k
press: 1.00000 atm
elementType: 53 9 9 9 9 9 9 9 9 9 6 6 6 6
symmnumber: 1
zpe: 119201.3 jmol-1
zpe.correction: 0.045401 hartree
zpe.thermalcorrener: 0.059330 hartree
zpe.thermalcorrenthalpy: 0.060274 hartree
zpe.thermalcorrgfe: 0.003286 hartree
zpe.sumelectzpe: -1061.398365 hartree
zpe.sumelectthermal: -1061.384436 hartree
zpe.sumelectthermalent: -1061.383492 hartree
zpe.sumelectthermalfe: -1061.440480 hartree
dipole: -2.4709 -0.0023 0.0013
dipole: 2.4709
quadrupole: -86.7889 -94.8752 -94.8689
quadrupole: 0.0026 -0.0086 -0.0039
quadrupole: 5.3888 -2.6975 -2.6913 0.0026 -0.0086 -0.0039
hfenergy: -1061.443766 hartree
pointgroup: C01 [X(C4F9I1)]
dipole: 0.007903 -0.0021696 -0.9720736 debye
dipolederiv: 0.1589594 0.0050048 0.0020386 -0.0047732 0.1589525 -0.0004776 0.0016775 -0.0004601 -0.0227733 -0.3022134 0.0487324 0.0178057 0.0377337 -0.3614744 -0.251697 -0.0700464 -0.0911959 -0.773299 -0.3086378 -0.0372804 0.071699 -0.1087173 -0.6998134 0.1112848 0.0925255 0.1277521 -0.3567341 -0.7811075 -0.0390065 -0.0137704 0.0409462 -0.3316619 -0.0411573 -0.0264628 -0.038241 -0.2662277 -0.6619095 -0.0994441 -0.1344821 -0.1708299 -0.3436466 0.0043702 -0.1583807 0.0146 -0.3606175 -0.4444638 0.1549667 0.0390635 0.2346244 -0.6687935 0.0154116 0.0420061 0.0023735 -0.2653701 -0.3124656 -0.0390624 0.2138986 -0.0527201 -0.3537489 0.1357275 0.1196215 -0.0200359 -0.7712381 -0.380633 0.0089409 -0.2219562 -0.0028049 -0.2802002 0.1118503 -0.0394126 0.1080244 -0.7761974 -0.540144 0.2430671 0.0579031 0.1713414 -0.4699985 -0.1155047 0.0622198 -0.1414427 -0.3569171 -0.4446557 -0.2356758 -0.0318635 -0.1558344 -0.6681 0.0293333 -0.0229422 0.0379665 -0.2669131 -0.4456129 -0.0175814 -0.0056822 0.017212 -0.4461363 0.0020658 -0.006052 0.0013565 0.282013 1.4457765 -0.0660881 -0.1863548 -0.0728997 1.5320514 0.3188592 0.0107625 0.0052465 1.3091178 1.4521526 0.0733877 -0.1813977 0.0718437 1.5249479 -0.3226412 -0.0091826 0.00567 1.3108272 1.5649547 0.0000391 0.3730984 -0.0051218 1.4076217 0.002575 0.0036665 -0.011614 1.3143294 unknown
polarizability: 54.5355041|-0.0067458|54.536652|-0.2811744|0.0752579|92.4265666 unknown
InChI: InChI=1S/C4F9I/c5-2(6,7)1(14,3(8,9)10)4(11,12)13
charge 0 multiplicity 1
14 atoms
I  0.019197 -0.004949 -2.594838
F  -0.5640 1.506954 1.486161
F  -0.358134 2.439489 -0.555849
F  -2.147042 1.142935 -0.094127
F  -1.926819 -1.53702 -0.559613
F  0.086323 -2.430288 -0.065584
F  -1.038073 -1.224784 1.489578
F  1.568704 -0.270201 1.505268
F  2.295742 -0.909794 -0.531212
F  2.064464 1.287295 -0.064774
C  0.002349 -0.000402 -0.378466
C  -0.765269 1.280317 0.11261
C  -0.726792 -1.301357 0.119658
C  1.48935 0.021805 0.131288
