program: Gaussian 09
title: 000138258
version: EM64L-G09RevD.01
frameworkgroup: C1[X(C6H12Br2)]
method: RPBEPBE
basis: SDD
operation: Freq
keyword: #pfreq=noraman
keyword: PBEPBE/SDD
title: #p freq=noraman PBEPBE/SDD
converged: YES YES NO NO
title: Mulliken charges:
elementType: Br Br C C C C C C H H H H H H H H H H H H
charge: -0.033651 -0.033808 -0.015155 -0.326897 -0.327245 -0.728353 -0.716160 -0.716557 0.195633 0.227001 0.231884 0.232114 0.227067 0.219332 0.220028 0.216806 0.277659 0.286022 0.277539 0.286741
chargesum: 0.00000
title: Mulliken charges with hydrogens summed into heavy atoms:
elementType: Br Br C C C C C C
charge: -0.033651 -0.033808 0.180478 0.131988 0.131936 -0.072187 -0.152479 -0.152276
polarizability: 1.42445481e+02 5.21101198e-02 8.31700476e+01 -1.28066647e-01 5.30518977e+00 6.32209584e+01
1716.lowfreq: -3.6490 -0.0004 -0.0004 -0.0002 7.1051 16.5941 50.8557 51.8576 67.0638
frequency: 50.6531 51.4921 66.4924 87.1218 102.0266 162.1156 180.8171 224.7437 251.9037 360.9886 431.0154 444.4264 603.7585 640.1358 754.9262 766.3935 838.3910 914.0889 918.6425 941.9262 1032.3642 1044.0391 1076.3726 1079.6655 1097.9190 1158.9361 1196.5620 1219.9922 1234.0626 1272.4497 1286.7569 1289.5450 1327.3868 1333.8300 1348.2257 1398.0154 1451.0155 1453.6141 1463.7162 1473.6548 1476.3215 1492.2077 2955.1776 2979.0665 2991.8149 2996.0170 3049.7134 3052.3902 3052.8215 3056.6079 3074.0866 3077.9005 3138.8714 3139.5355
redmass: 2.9687 3.7690 3.1085 2.6767 2.0926 10.1200 4.5346 1.2639 2.7162 2.9554 2.9496 2.2251 6.1352 4.0295 1.1316 1.2165 2.4543 1.5091 1.2435 1.9225 3.2290 1.2042 3.5073 1.1377 3.3471 1.6400 1.5953 1.1523 1.1768 1.1941 1.2229 1.1605 1.2968 1.4227 1.3342 1.2101 1.0992 1.1041 1.0942 1.0882 1.0544 1.0453 1.0828 1.0371 1.0596 1.0597 1.0902 1.0587 1.0691 1.1020 1.0978 1.0983 1.1105 1.1104
irintensity: 0.6160 0.9027 0.6737 1.4314 0.0276 0.9452 5.8567 0.0304 3.7854 0.0096 6.0248 0.6673 10.5883 60.7033 0.5511 18.2058 0.1582 13.9114 3.2414 0.8787 8.0838 1.7372 0.2555 2.0028 1.3349 7.9996 2.6213 0.3210 32.9622 5.4274 3.3376 39.7183 7.5477 16.3636 0.6258 22.3784 3.5061 2.7166 0.2915 6.6381 2.6226 28.9811 19.4192 25.2468 1.7125 26.2005 0.0334 32.1154 1.3710 28.8125 55.1154 47.3281 0.6368 28.2750
temp: 298.150 k
press: 1.00000 atm
elementType: 35 35 6 6 6 6 6 6 1 1 1 1 1 1 1 1 1 1 1 1
symmnumber: 1
zpe: 440002.7 jmol-1
zpe.correction: 0.167588 hartree
zpe.thermalcorrener: 0.178506 hartree
zpe.thermalcorrenthalpy: 0.179450 hartree
zpe.thermalcorrgfe: 0.127245 hartree
zpe.sumelectzpe: -262.091778 hartree
zpe.sumelectthermal: -262.080860 hartree
zpe.sumelectthermalent: -262.079916 hartree
zpe.sumelectthermalfe: -262.132121 hartree
dipole: -0.0016 2.5130 0.7933
dipole: 2.6352
quadrupole: -93.9419 -67.8751 -68.6179
quadrupole: -0.0216 0.0274 0.7712
quadrupole: -17.1303 8.9366 8.1937 -0.0216 0.0274 0.7712
hfenergy: -262.2593658 hartree
pointgroup: C01 [X(C6H12Br2)]
dipole: -0.0021393 -0.9863205 -0.3195047 debye
dipolederiv: -0.6158388 -0.1143046 -0.0110636 -0.241239 -0.2285608 -0.0168439 -0.0719988 -0.0321171 -0.158684 -0.6145599 0.1155732 0.0103106 0.2438394 -0.2307304 -0.0163142 0.0690944 -0.0315182 -0.1582064 0.023344 -0.0002406 -0.0001791 0.000205 0.2086598 -0.0159766 0.0012222 0.035432 0.1975371 -0.21713 -0.0080764 0.0107711 -0.0980407 -0.0599817 -0.0322941 -0.0488429 -0.058789 0.10139 -0.2161083 0.0078831 -0.0102104 0.0974714 -0.0621528 -0.0307534 0.0483272 -0.0570993 0.1033457 -0.0215464 0.0002322 0.0001807 -0.0005249 -0.0856975 0.0562647 -0.0002623 0.0210336 0.0669737 0.743361 0.2858506 0.0746634 0.2917087 0.2746071 0.0417015 0.0729334 0.0561888 0.149118 0.7406144 -0.2886683 -0.0717555 -0.2946026 0.2791274 0.0404546 -0.0695413 0.0552277 0.1477476 0.0681641 0.0002604 0.0003728 0.0001811 0.0160187 -0.0079091 0.0006068 -0.0178774 -0.1934888 0.0501585 -0.0056738 0.017978 0.024114 0.0794881 -0.0102486 0.0108275 -0.02904 -0.1293596 0.0682279 0.01629 -0.0141936 0.0366606 -0.1137941 0.0626954 0.0092835 0.0724124 0.0476722 0.0679188 -0.01608 0.0148905 -0.0366386 -0.1117383 0.0644542 -0.0085556 0.0739326 0.046302 0.049921 0.0055403 -0.0190228 -0.0239936 0.0787314 -0.0124633 -0.0116749 -0.0315041 -0.1290475 -0.0898595 0.1607662 0.047259 0.1486718 0.0208927 -0.0100932 0.0488897 -0.0227248 0.065515 -0.0875703 -0.1595984 -0.0496312 -0.1484281 0.0199063 -0.0112645 -0.0514873 -0.0241266 0.0636075 0.0993255 -0.0007436 0.0021827 0.0001751 0.0657115 -0.0658974 0.00253 0.0149607 -0.1471102 -0.0224021 -0.0681921 -0.0663518 -0.0540032 0.0413338 -0.053617 0.0035803 -0.0527701 -0.0971415 -0.0020984 -0.0596792 -0.016552 -0.0046756 -0.1161684 0.035943 -0.0328624 0.0406315 0.0604428 -0.0215603 0.0693368 0.0648114 0.0538657 0.0387668 -0.056577 -0.004603 -0.0553397 -0.0954206 -0.0023612 0.0595244 0.0155399 0.0052536 -0.1144195 0.0387387 0.0325334 0.043087 0.0588071 unknown
polarizability: 142.4451612|-0.1447072|83.0899513|0.1405786|5.4534559|63.3013744 unknown
InChI: InChI=1S/C6H12Br2/c1-6(2-4-7)3-5-8/h6H,2-5H2,1H3
charge 0 multiplicity 1
20 atoms
Br 4.160739 0.961461 0.086125
Br -4.158933 0.975565 0.083618
C  -0.001417 -0.417737 -0.250752
C  1.263228 0.409117 0.138295
C  -1.263264 0.414116 0.136687
C  -0.004351 -1.817441 0.412547
C  2.563009 -0.216738 -0.372633
C  -2.566699 -0.216313 -0.359007
H  -0.001256 -0.548207 -1.355204
H  1.308251 0.512321 1.239741
H  1.170884 1.429886 -0.278438
H  -1.172442 1.429905 -0.29231
H  -1.301557 0.530007 1.237162
H  0.886448 -2.406702 0.130933
H  -0.888007 -2.410129 0.116017
H  -0.013498 -1.723122 1.515468
H  2.591241 -0.303683 -1.470332
H  2.801733 -1.182677 0.095563
H  -2.598757 -0.322909 -1.454898
H  -2.807453 -1.17272 0.127318
