program: Gaussian 09
title: 000138256
version: EM64L-G09RevD.01
frameworkgroup: C1[X(C3HNO)]
method: RPBEPBE
basis: SDD
operation: Freq
keyword: #pfreq=noraman
keyword: PBEPBE/SDD
title: #p freq=noraman PBEPBE/SDD
converged: YES YES YES YES
title: Mulliken charges:
elementType: O N C C C H
charge: -0.053438 -0.009951 -0.325388 0.221657 -0.122834 0.289955
chargesum: 0.00000
title: Mulliken charges with hydrogens summed into heavy atoms:
elementType: O N C C C
charge: -0.053438 -0.009951 -0.035433 0.221657 -0.122834
polarizability: 6.76960556e+01 -4.03214122e-01 2.84659717e+01 2.17930009e-04 -2.85772265e-05 1.63863999e+01
1716.lowfreq: -4.2305 0.0008 0.0009 0.0012 3.0222 6.0066 141.9230 397.4345 400.8436
frequency: 141.9229 397.4344 400.8436 469.4181 627.0717 641.9139 936.4851 1120.0077 1346.1814 2118.0260 2182.8863 3138.1719
redmass: 11.7088 2.6299 7.7086 9.1997 12.0933 2.1723 7.7053 1.4684 3.3619 12.4244 12.4918 1.0859
irintensity: 5.1290 7.1249 1.0566 0.9858 0.9080 64.2303 1.6413 8.2616 1.2277 586.5863 46.3910 25.9067
temp: 298.150 k
press: 1.00000 atm
elementType: 8 7 6 6 6 1
symmnumber: 1
zpe: 80869.7 jmol-1
zpe.correction: 0.030802 hartree
zpe.thermalcorrener: 0.035524 hartree
zpe.thermalcorrenthalpy: 0.036468 hartree
zpe.thermalcorrgfe: 0.003265 hartree
zpe.sumelectzpe: -244.490881 hartree
zpe.sumelectthermal: -244.486159 hartree
zpe.sumelectthermalent: -244.485215 hartree
zpe.sumelectthermalfe: -244.518417 hartree
dipole: 2.6091 2.2532 0.0000
dipole: 3.4474
quadrupole: -38.2942 -24.9232 -28.3231
quadrupole: -1.0201 -0.0001 0.0001
quadrupole: -7.7807 5.5903 2.1904 -1.0201 -0.0001 0.0001
hfenergy: -244.5216828 hartree
pointgroup: C01 [X(C3H1N1O1)]
dipole: -1.0381343 -0.8728173 0.0003786 debye
dipolederiv: -1.3133196 0.3456919 -0.000105 0.6280625 -0.3197125 0.0000625 -0.0001964 0.0000644 -0.1195016 -0.4042602 0.0223931 -0.0000216 -0.0900968 -0.2131902 -0.0000177 0.0000359 -0.0000123 -0.2423259 -0.7787436 0.1338604 -0.00004 0.1793873 -0.1235037 -0.0000812 -0.0000514 -0.0000818 -0.2952104 1.8463097 -0.6146835 0.0002002 -0.9520268 0.5267364 -0.0000646 0.0003112 -0.0000682 0.3034107 0.5739977 0.1210759 -0.0000362 0.3024824 -0.0060524 0.0000458 -0.0001227 0.0000394 0.0913675 0.076016 -0.0083377 0.0000026 -0.0678086 0.1357224 0.0000551 0.0000234 0.0000585 0.2622597 unknown
polarizability: 67.6785484|-0.921458|28.4834771|-0.0009128|-0.0046563|16.3864018 unknown
InChI: InChI=1S/C3HNO/c4-2-1-3-5/h1H
charge 0 multiplicity 1
6 atoms
O  -2.268039 0.470021 -0.000055
N  2.299014 0.440312 -0.00015
C  -0.03731 -0.752384 0.000357
C  -1.210103 -0.094116 0.000123
C  1.222926 -0.08661 0.0001
H  -0.071888 -1.848224 0.000825
