program: Gaussian 09
title: 000138244
version: EM64L-G09RevD.01
frameworkgroup: C1[X(C11H22O)]
method: RPBEPBE
basis: SDD
operation: Freq
keyword: #pfreq=noraman
keyword: PBEPBE/SDD
title: #p freq=noraman PBEPBE/SDD
converged: YES YES NO NO
title: Mulliken charges:
elementType: O C C C C C C C C C C C H H H H H H H H H H H H H H H H H H H H H H
charge: -0.207183 0.298896 0.299175 -0.505542 -0.506000 0.163727 -0.714755 -0.712624 -0.714591 -0.714821 -0.712767 -0.714729 0.212278 0.219206 0.212369 0.219308 0.213061 0.201917 0.225438 0.251618 0.199655 0.208448 0.214180 0.208253 0.216295 0.213073 0.201882 0.225538 0.251865 0.208379 0.199689 0.216296 0.214209 0.208256
chargesum: 0.00000
title: Mulliken charges with hydrogens summed into heavy atoms:
elementType: O C C C C C C C C C C C
charge: -0.207183 0.298896 0.299175 -0.074057 -0.074323 0.163727 -0.074339 -0.052902 -0.075863 -0.074328 -0.052833 -0.075969
polarizability: 1.43248561e+02 -1.17595792e-03 1.15833119e+02 2.60799932e+00 -1.56624295e-03 1.07060861e+02
1716.lowfreq: -0.0003 0.0005 0.0006 12.1540 13.2432 23.4663 43.3967 45.0011 69.2975
frequency: 42.9102 43.6152 69.2594 98.0841 157.5964 166.9220 210.5269 214.5878 236.8897 264.2730 272.5092 273.4119 278.5780 291.7156 306.9423 317.2298 370.9010 382.9831 391.8825 402.6597 414.6403 440.0596 447.7560 518.0157 673.6736 702.2801 792.0587 812.0104 881.0445 904.3707 913.0039 924.7990 930.0290 931.6519 934.5171 939.9956 947.8993 948.1887 1016.7044 1018.3322 1030.4233 1045.9086 1097.4450 1150.7281 1187.7442 1210.2465 1218.5705 1228.6458 1235.1270 1281.4382 1281.8130 1295.6302 1312.3831 1375.0005 1375.0514 1381.1573 1381.3962 1404.5214 1405.1248 1446.4182 1452.2792 1458.5743 1458.6378 1463.5402 1466.2554 1467.7688 1468.2199 1480.3884 1481.0600 1487.3935 1488.6580 1494.4592 1494.5603 1602.8078 2965.4101 2965.6135 2969.0410 2969.4446 2977.7129 2977.8714 2986.0983 2989.6576 3052.6762 3057.8467 3061.0212 3061.2996 3064.5759 3064.7880 3066.6473 3068.4655 3068.6065 3069.5104 3072.8382 3073.1665 3089.1231 3089.2277
redmass: 2.6465 4.3046 3.3569 2.6347 3.6523 4.2881 1.0388 1.0689 1.8463 1.1316 1.2364 1.2397 1.0635 1.7132 2.4494 2.3186 2.2350 2.4523 2.4054 2.1168 2.4516 1.8564 2.1425 2.9160 4.2790 3.9025 3.6811 2.9958 2.0254 2.1926 2.1567 2.1494 1.5923 1.6962 1.5370 1.4139 1.2211 1.2366 1.4876 1.3928 1.4360 1.4844 1.4888 1.3492 1.8618 2.0679 3.1008 2.5945 2.7386 2.0499 1.8439 1.6769 1.7595 1.1979 1.1972 1.1979 1.1980 1.2056 1.2048 1.1051 1.0926 1.0495 1.0497 1.0484 1.0517 1.0473 1.0501 1.0638 1.0596 1.0575 1.0563 1.0571 1.0597 7.7670 1.0348 1.0348 1.0354 1.0351 1.0368 1.0366 1.0568 1.0567 1.1041 1.1029 1.1000 1.1001 1.1001 1.1000 1.0993 1.0995 1.0994 1.0994 1.0985 1.0984 1.0987 1.0987
irintensity: 0.0188 2.0982 0.2723 0.9108 0.0258 5.4045 0.0151 0.6924 0.1373 0.1370 0.2952 0.0352 0.0361 0.5028 0.1899 0.1084 0.0836 0.1351 0.0047 0.2922 0.0779 0.1899 0.1820 15.1371 0.8311 0.2796 1.0615 0.0303 0.8126 0.0758 2.9258 1.9448 0.7922 1.9541 0.9639 0.3785 0.0809 0.0183 13.0923 0.7751 0.3872 0.3535 24.4427 0.0010 0.2611 26.2911 163.8745 8.2280 17.3152 9.5336 10.9855 13.8808 65.8681 33.4676 5.6127 18.0534 35.7853 3.2636 21.6862 5.7922 0.2405 1.3042 0.9670 1.4790 0.8811 0.7900 0.4492 0.9578 19.9412 9.0475 26.4334 42.5469 4.1044 90.0695 38.0947 34.9168 38.0528 17.4064 51.4637 14.2821 25.0285 8.5529 5.5299 0.2598 1.5394 2.3362 3.6708 3.7530 76.0633 13.2772 15.0789 101.9888 178.9144 21.2123 50.5408 5.5219
temp: 298.150 k
press: 1.00000 atm
elementType: 8 6 6 6 6 6 6 6 6 6 6 6 1 1 1 1 1 1 1 1 1 1 1 1 1 1 1 1 1 1 1 1 1 1
symmnumber: 1
zpe: 800029.7 jmol-1
zpe.correction: 0.304715 hartree
zpe.thermalcorrener: 0.320325 hartree
zpe.thermalcorrenthalpy: 0.321269 hartree
zpe.thermalcorrgfe: 0.263090 hartree
zpe.sumelectzpe: -506.592081 hartree
zpe.sumelectthermal: -506.576472 hartree
zpe.sumelectthermalent: -506.575528 hartree
zpe.sumelectthermalfe: -506.633706 hartree
dipole: 0.0001 -2.8836 0.0015
dipole: 2.8836
quadrupole: -73.6197 -84.7426 -76.3699
quadrupole: -0.0021 0.0228 0.0034
quadrupole: 4.6243 -6.4985 1.8742 -0.0021 0.0228 0.0034
hfenergy: -506.8967965 hartree
pointgroup: C01 [X(C11H22O1)]
dipole: -0.0093509 -1.1343378 -0.0166633 debye
polarizability: 143.3106384|-0.2609943|115.8335605|2.1133015|0.115324|106.998342 unknown
InChI: InChI=1S/C11H22O/c1-10(2,3)7-9(12)8-11(4,5)6/h7-8H2,1-6H3
charge 0 multiplicity 1
34 atoms
O  0.019296 1.878425 0.033693
C  -2.452789 -0.246457 0.041983
C  2.455144 -0.28587 -0.038709
C  -1.08469 -0.146632 -0.73698
C  1.090205 -0.185481 0.745908
C  0.00891 0.612377 0.015729
C  -2.245264 -0.893432 1.437476
C  -3.083825 1.159902 0.206263
C  -3.400275 -1.142013 -0.800451
C  2.233808 -0.886908 -1.452653
C  3.110291 1.113621 -0.162151
C  3.388436 -1.222909 0.773789
H  -0.739577 -1.171491 -0.970425
H  -1.280193 0.385188 -1.688044
H  0.728712 -1.210722 0.951291
H  1.295891 0.316012 1.711188
H  -3.219584 -1.03115 1.942401
H  -1.76521 -1.887392 1.35521
H  -1.617804 -0.258988 2.090454
H  -2.412608 1.845723 0.75078
H  -4.037787 1.08599 0.762133
H  -3.294991 1.616323 -0.778631
H  -3.550976 -0.72081 -1.812196
H  -2.99384 -2.165265 -0.91151
H  -4.391213 -1.220106 -0.314861
H  3.204648 -1.026264 -1.963818
H  1.736903 -1.874571 -1.399178
H  1.615998 -0.222501 -2.084728
H  2.448831 1.827498 -0.681998
H  3.333356 1.535418 0.835452
H  4.060517 1.040388 -0.724441
H  4.377301 -1.302467 0.284184
H  3.547672 -0.836206 1.797966
H  2.965109 -2.242232 0.853674
