program: Gaussian 09
title: 000138240
version: EM64L-G09RevD.01
frameworkgroup: C1[X(C20H18)]
method: RPBEPBE
basis: SDD
operation: Freq
keyword: #p
keyword: freq=noraman
keyword: PBEPBE/SDD
title: #p freq=noraman PBEPBE/SDD
converged: YES YES NO NO
title: Mulliken charges:
elementType: C C C C C C C C C C C C C C C C C C C C H H H H H H H H H H H H H H H H H H
charge: 0.358410 0.358412 -0.603326 -0.603325 0.278481 0.278475 -0.586036 -0.586037 0.527703 0.527703 -0.452159 -0.452164 -0.446470 -0.446469 -0.418173 -0.418180 -0.410891 -0.410885 -0.258370 -0.258369 0.212926 0.220845 0.220845 0.212926 0.217342 0.213836 0.213837 0.217341 0.229241 0.229241 0.233168 0.233168 0.224805 0.224807 0.234145 0.234145 0.224527 0.224527
chargesum: 0.00000
title: Mulliken charges with hydrogens summed into heavy atoms:
elementType: C C C C C C C C C C C C C C C C C C C C
charge: 0.358410 0.358412 -0.169556 -0.169554 0.278481 0.278475 -0.154859 -0.154859 0.527703 0.527703 -0.222918 -0.222923 -0.213302 -0.213301 -0.193368 -0.193374 -0.176746 -0.176740 -0.033843 -0.033842
polarizability: 2.07160209e+02 -1.64368571e-03 2.28660354e+02 4.55149338e+01 3.00726867e-03 1.50971764e+02
1716.lowfreq: -5.4779 -4.6167 -0.0007 -0.0005 -0.0002 18.0619 33.1427 49.7768 112.4565
frequency: 33.1078 49.7721 112.4539 121.5133 174.9528 188.1506 224.2059 245.6262 260.4009 298.7497 314.7494 326.5819 380.8198 422.9654 427.9297 438.9218 459.1804 472.6595 496.7590 506.6674 531.5963 532.1399 583.3191 630.5645 652.2617 659.1690 681.5453 690.0097 725.9892 758.7176 766.6852 777.4468 778.6200 788.7668 792.0291 804.6915 823.5770 824.6953 866.8951 872.0715 881.7699 883.9092 923.6807 937.6952 939.7865 950.4715 955.9251 979.1610 985.0955 1011.7450 1015.5116 1039.4147 1040.0121 1106.0195 1146.2919 1148.8609 1165.1668 1168.2281 1173.7631 1181.9713 1185.1388 1186.5959 1203.3319 1204.4587 1237.4333 1243.9941 1256.2629 1263.9056 1268.8868 1309.6365 1314.5552 1315.9745 1365.0123 1369.0036 1386.4622 1397.0878 1407.3197 1430.6370 1455.4073 1462.6440 1463.6483 1482.6568 1482.8865 1500.1648 1521.2576 1571.7456 1583.5828 1585.6137 1610.1546 1620.7673 2988.0786 2988.2828 3002.3697 3003.3591 3039.0808 3039.3710 3063.9111 3064.3570 3099.7235 3105.8561 3113.3354 3120.5352 3126.3974 3128.9533 3132.0054 3140.4670 3143.0076 3160.2541
redmass: 2.5940 4.4090 3.3969 4.2354 5.0775 3.7673 2.7638 3.0665 2.5329 3.1411 3.2475 2.5184 5.3800 2.7645 3.4537 3.3981 4.6559 4.4340 3.1903 5.0308 4.5283 4.6384 2.9098 6.3599 3.7969 2.8435 4.8945 3.3745 3.9669 2.9629 1.4734 3.2671 1.4007 2.2951 2.6591 1.4096 1.5645 1.9432 2.4708 2.0394 3.3297 3.9153 1.4378 2.1649 1.4552 1.4179 1.3941 1.8777 1.3263 2.9095 2.9328 4.0627 1.9380 1.4407 1.8982 1.4112 1.2301 1.1323 1.1163 1.2647 1.4630 1.1519 1.6581 2.0172 2.1472 1.5761 1.1732 1.2227 1.4735 1.4412 1.6055 1.2989 4.3583 5.6419 2.1241 4.3754 2.5610 2.9453 2.7508 1.1124 1.1082 1.1152 1.1344 2.6354 3.5769 6.4491 7.9059 5.5861 6.4229 6.4619 1.0587 1.0588 1.0603 1.0603 1.1033 1.1032 1.1045 1.1044 1.0863 1.0870 1.0868 1.0840 1.0962 1.0879 1.0956 1.0970 1.0945 1.1005
irintensity: 0.0378 0.1304 0.3727 0.0330 0.0013 1.2477 0.8050 0.4759 0.5293 1.3454 0.1449 0.0046 0.0743 0.1662 5.8779 2.4540 6.6560 0.0577 0.1508 8.4776 0.0740 5.7561 21.3909 0.0149 7.0842 2.7185 0.1220 0.6549 8.7424 1.8653 19.9720 0.9622 108.3083 11.3326 0.0184 6.3565 8.6833 0.3492 33.9905 0.2286 1.4218 10.0759 6.4144 1.8443 5.0559 0.7384 1.5382 3.1764 0.3568 0.2619 6.1548 0.0033 2.8715 5.2453 1.8381 2.2880 1.3362 2.2505 0.0671 4.6777 0.5329 1.7374 1.0717 1.8457 4.7403 0.1228 13.6390 0.2228 0.3125 0.2308 0.9549 0.0702 0.5570 0.8621 7.2680 3.0708 6.2253 4.0811 0.0001 2.3589 7.0516 17.6378 2.7310 13.6588 5.2063 0.2013 3.5403 5.1928 3.9238 0.5272 2.6618 43.5026 194.1999 1.8997 0.7829 0.0429 0.0962 60.3859 1.2139 20.1328 9.5726 0.8723 10.1553 0.0843 51.4395 2.1208 35.4781 34.8742
temp: 298.150 k
press: 1.00000 atm
elementType: 6 6 6 6 6 6 6 6 6 6 6 6 6 6 6 6 6 6 6 6 1 1 1 1 1 1 1 1 1 1 1 1 1 1 1 1 1 1
symmnumber: 1
zpe: 827080.2 jmol-1
zpe.correction: 0.315018 hartree
zpe.thermalcorrener: 0.330103 hartree
zpe.thermalcorrenthalpy: 0.331047 hartree
zpe.thermalcorrgfe: 0.273623 hartree
zpe.sumelectzpe: -771.521470 hartree
zpe.sumelectthermal: -771.506385 hartree
zpe.sumelectthermalent: -771.505441 hartree
zpe.sumelectthermalfe: -771.562865 hartree
dipole: 0.0856 0.0000 0.1657
dipole: 0.1865
quadrupole: -113.4166 -103.7694 -123.2043
quadrupole: -0.0007 12.7362 0.0009
quadrupole: 0.0468 9.6941 -9.7409 -0.0007 12.7362 0.0009
hfenergy: -771.8364881 hartree
pointgroup: C01 [X(C20H18)]
dipole: -0.0248383 0.0000049 0.0690533 debye
polarizability: 194.3590827|0.0104594|228.6603512|-51.2544201|0.0156476|163.772893 unknown
InChI: InChI=1S/C20H18/c1-2-4-20-18-12-10-16-7-5-15(6-8-16)9-11-17(13-14-18)19(20)3-1/h1-8,13-14H,9-12H2
charge 0 multiplicity 1
38 atoms
C  0.245501 -1.440893 1.236596
C  0.24628 1.440696 1.236667
C  -0.220809 -2.834934 0.836585
C  -0.21928 2.835007 0.836719
C  1.262997 -0.728165 0.491001
C  1.263392 0.727453 0.491039
C  -1.182874 -2.831203 -0.466744
C  -1.181373 2.831847 -0.466585
C  -1.599534 -1.428413 -0.888937
C  -1.598784 1.429299 -0.888844
C  -0.484896 -0.714617 2.184028
C  -0.484506 0.714772 2.184066
C  2.227877 -1.41161 -0.316198
C  2.228647 1.410412 -0.316125
C  -2.58934 -0.705685 -0.172206
C  -2.588974 0.707048 -0.172162
C  -0.829824 -0.7061 -1.836377
C  -0.829448 0.706639 -1.836324
C  3.17212 -0.714296 -1.077098
C  3.172508 0.712619 -1.077062
H  0.621879 -3.520027 0.629154
H  -0.786316 -3.274084 1.678671
H  -0.784532 3.274427 1.678835
H  0.623771 3.519657 0.629297
H  -2.062491 -3.45649 -0.223827
H  -0.644586 -3.328155 -1.294858
H  -0.642849 3.328555 -1.294692
H  -2.060653 3.457592 -0.223625
H  -1.208247 -1.236932 2.821896
H  -1.207567 1.237445 2.82197
H  2.23689 -2.507082 -0.321006
H  2.238264 2.505879 -0.320877
H  -3.276967 -1.243271 0.492855
H  -3.276325 1.244952 0.492926
H  -0.121649 -1.24056 -2.480895
H  -0.120979 1.240769 -2.480791
H  3.915046 -1.260413 -1.669168
H  3.915732 1.258361 -1.669104
