program: Gaussian 09
title: 000138239
version: EM64L-G09RevD.01
frameworkgroup: C1[X(C7H16O4)]
method: RPBEPBE
basis: SDD
operation: Freq
keyword: #pfreq=noraman
keyword: PBEPBE/SDD
title: #p freq=noraman PBEPBE/SDD
converged: YES YES NO NO
title: Mulliken charges:
elementType: O O O O C C C C C C C H H H H H H H H H H H H H H H H
charge: -0.284392 -0.247225 -0.244491 -0.271557 -0.243170 -0.184394 -0.187971 -0.218275 -0.256951 -0.677997 -0.667753 0.240489 0.220249 0.202202 0.226135 0.199881 0.227495 0.213850 0.185819 0.198011 0.243274 0.203343 0.227535 0.233793 0.206641 0.225049 0.230407
chargesum: 0.00000
title: Mulliken charges with hydrogens summed into heavy atoms:
elementType: O O O O C C C C C C C
charge: -0.284392 -0.247225 -0.244491 -0.271557 0.217568 0.243944 0.239406 0.181394 0.184335 -0.013326 -0.005655
polarizability: 1.02582774e+02 -8.55160847e-02 9.39168379e+01 1.54817420e+00 1.75199818e+00 8.24920439e+01
1716.lowfreq: -13.6251 -2.7036 0.0007 0.0008 0.0010 10.3759 25.2198 35.5475 44.0000
frequency: 22.4481 34.4525 43.6651 67.9511 73.4670 102.6813 133.6198 171.7917 196.0796 230.1154 241.1079 279.6716 289.7749 331.0049 340.7159 404.3912 488.5958 551.7278 601.6210 796.7007 801.2076 813.8074 814.7364 825.8549 844.0059 890.1923 990.0220 1012.1536 1018.6934 1035.9445 1060.5381 1082.6425 1095.8859 1114.3005 1129.6398 1138.7596 1140.2981 1146.6502 1237.6165 1239.8191 1248.3034 1255.1450 1259.3595 1356.2242 1364.2991 1365.1371 1389.1365 1394.6041 1398.4789 1399.7922 1454.4326 1458.1232 1459.6462 1463.2858 1464.2856 1479.7598 1480.3930 1492.8909 1501.4232 2931.1371 2939.2642 2954.0933 2965.5251 2994.1380 2995.4988 3013.4130 3016.4679 3021.4659 3054.1575 3091.5032 3092.8109 3094.4811 3100.5104 3101.0220 3103.3092
redmass: 3.4744 4.1209 2.6222 1.9048 3.4098 2.4928 2.5436 4.8345 3.9189 1.2315 1.3108 2.2547 2.1723 3.2961 2.6805 3.2595 4.9400 3.5399 5.1050 3.1437 2.9334 1.1274 1.1047 4.6176 5.3338 8.7660 4.4869 3.0370 2.6771 2.0900 2.1526 2.4782 2.8099 2.3218 1.9028 1.5982 1.4953 2.0098 1.0905 1.1392 1.1313 1.0954 1.1343 1.2633 1.1590 1.2049 1.1783 1.1810 1.2712 1.2620 1.0896 1.0429 1.0407 1.0898 1.0834 1.0493 1.0470 1.0813 1.0814 1.0620 1.0618 1.0596 1.0630 1.0360 1.0361 1.0579 1.0984 1.1055 1.1018 1.0991 1.0988 1.1100 1.1011 1.1012 1.1012
irintensity: 0.6574 0.4408 0.5136 0.4443 2.3734 8.6665 5.8987 18.9218 3.3475 2.3676 0.7306 15.4467 7.9690 0.8255 5.3596 15.3381 6.7051 6.0460 12.7315 37.1607 4.8005 10.4586 2.9023 49.4107 140.4274 340.8551 100.8780 55.3739 50.6152 77.9896 61.3675 35.6694 75.5075 33.4689 13.9661 3.1605 8.8723 50.3802 7.2063 7.6987 2.5189 7.3668 0.3637 6.5932 4.4428 7.7263 11.8307 24.3585 10.8173 11.7539 1.1519 6.4782 11.2432 1.9679 11.3877 7.6096 8.3377 5.5085 4.0591 54.7670 58.1744 14.0377 108.7434 22.4839 23.0658 59.8776 38.5166 23.9145 47.1842 30.2803 31.3996 22.2887 18.9214 49.1981 41.8500
temp: 298.150 k
press: 1.00000 atm
elementType: 8 8 8 8 6 6 6 6 6 6 6 1 1 1 1 1 1 1 1 1 1 1 1 1 1 1 1
symmnumber: 1
zpe: 604041.6 jmol-1
zpe.correction: 0.230067 hartree
zpe.thermalcorrener: 0.244208 hartree
zpe.thermalcorrenthalpy: 0.245152 hartree
zpe.thermalcorrgfe: 0.186737 hartree
zpe.sumelectzpe: -576.239262 hartree
zpe.sumelectthermal: -576.225121 hartree
zpe.sumelectthermalent: -576.224177 hartree
zpe.sumelectthermalfe: -576.282592 hartree
dipole: 0.5198 1.2293 0.6679
dipole: 1.4925
quadrupole: -73.5739 -62.8496 -68.6739
quadrupole: -3.1019 7.1378 4.1737
quadrupole: -5.2081 5.5162 -0.3081 -3.1019 7.1378 4.1737
hfenergy: -576.4693294 hartree
pointgroup: C01 [X(C7H16O4)]
dipole: -0.1749649 -0.4997465 0.2538507 debye
polarizability: 102.6175694|0.6740363|93.9775663|-0.6609894|-1.7839656|82.39652 unknown
InChI: InChI=1S/C7H16O4/c1-3-8-5-10-7-11-6-9-4-2/h3-7H2,1-2H3
charge 0 multiplicity 1
27 atoms
O  -0.336852 0.716543 -0.948441
O  0.754992 1.615375 1.039932
O  -2.546505 -0.138115 -0.698023
O  2.502268 -0.072984 0.87304
C  0.615577 1.678988 -0.406822
C  -1.753508 1.043402 -0.635775
C  1.302293 0.34472 1.553538
C  -2.261349 -1.121108 0.370972
C  2.32464 -1.215813 -0.064603
C  -3.352744 -2.186824 0.306869
C  3.629619 -1.361722 -0.843438
H  1.570546 1.445569 -0.905767
H  0.303896 2.721548 -0.60028
H  -1.787588 1.519478 0.369802
H  -2.152691 1.710307 -1.420639
H  0.52289 -0.443458 1.495129
H  1.560493 0.586409 2.595763
H  -1.258702 -1.559047 0.199432
H  -2.258176 -0.601505 1.354972
H  2.115361 -2.131993 0.526256
H  1.464433 -1.020982 -0.735364
H  -3.175489 -2.965795 1.07089
H  -4.346428 -1.740502 0.48297
H  -3.361064 -2.667794 -0.68633
H  3.56815 -2.222167 -1.534505
H  3.836429 -0.453035 -1.435038
H  4.476207 -1.524695 -0.15444
