program: Gaussian 09
title: 000138235
version: EM64L-G09RevD.01
frameworkgroup: C1[X(C13H22O3)]
method: RPBEPBE
basis: SDD
operation: Freq
keyword: #pfreq=noraman
keyword: PBEPBE/SDD
title: #p freq=noraman PBEPBE/SDD
converged: NO YES NO NO
title: Mulliken charges:
elementType: O O O C C C C C C C C C C C C C H H H H H H H H H H H H H H H H H H H H H H
charge: -0.260045 -0.260058 -0.289310 0.017599 0.017611 -0.443387 -0.429484 -0.429484 -0.443379 -0.396823 -0.399271 -0.399270 -0.396820 -0.387779 -0.387781 0.288750 0.233428 0.233413 0.210248 0.216185 0.232826 0.204545 0.204539 0.232835 0.216186 0.210243 0.206438 0.196364 0.199399 0.205527 0.205526 0.199396 0.196361 0.206439 0.202555 0.191961 0.202553 0.191961
chargesum: 0.00000
title: Mulliken charges with hydrogens summed into heavy atoms:
elementType: O O O C C C C C C C C C C C C C
charge: -0.260045 -0.260058 -0.289310 0.251027 0.251024 -0.016954 0.007886 0.007890 -0.016949 0.005980 0.005656 0.005652 0.005981 0.006736 0.006734 0.288750
polarizability: 1.94629192e+02 -9.90473604e-05 1.32237274e+02 3.66033408e-04 2.10813481e+00 1.16899747e+02
1716.lowfreq: -2.8182 0.0004 0.0007 0.0009 17.4616 20.3938 35.9720 40.7697 54.9245
frequency: 35.8100 39.9579 54.7903 76.0070 87.2566 110.0190 170.0013 194.1637 215.4216 218.8924 235.8427 321.4543 325.2045 326.7266 331.3695 406.2935 430.7730 434.5028 447.8896 453.8113 479.5108 522.3569 622.0409 666.4115 697.6725 783.3881 788.1021 789.7458 799.6103 837.5758 840.1966 874.3750 877.2252 886.4268 896.0870 900.8132 910.6205 924.0563 924.4482 990.6078 994.2272 1028.4194 1045.6806 1049.2694 1054.0501 1055.2176 1081.6112 1082.9493 1111.3313 1111.7277 1152.2613 1153.6030 1174.9190 1200.0455 1201.2300 1241.9241 1242.8355 1253.7104 1253.7863 1260.4717 1261.5443 1304.5124 1306.6876 1308.7519 1309.0093 1331.8325 1331.8662 1336.9932 1339.7057 1340.2643 1341.0019 1351.4981 1352.3176 1363.5384 1366.8786 1463.1970 1463.6423 1464.5520 1464.6096 1465.6456 1465.8108 1473.7386 1473.8525 1481.8031 1482.1565 1606.0495 2969.8142 2969.9262 2970.9336 2970.9649 2972.4294 2972.5386 2987.6437 2987.9574 2990.8108 2991.0011 3010.5900 3011.1262 3033.2587 3033.4565 3035.8826 3035.9876 3044.1914 3044.2968 3056.8969 3057.0887 3065.0710 3065.3793
redmass: 2.7375 4.3006 4.2099 7.9308 3.7723 4.2033 3.1709 4.6049 1.8885 1.8160 3.4315 2.5643 2.5901 2.9161 2.7736 4.6156 3.0208 3.1010 2.4671 2.3103 1.7323 1.7640 3.2574 9.4252 12.2787 2.1682 1.4779 1.5043 2.3322 2.3745 2.5235 1.7168 3.2902 1.8816 1.7237 1.6035 2.6416 1.7733 1.7748 2.9285 2.6927 4.1550 1.7726 1.7981 1.1051 1.2284 1.3015 1.2760 2.6716 2.6879 2.2773 2.2956 4.5197 1.5149 1.5939 1.3169 1.3156 1.2785 1.2781 1.3100 1.3162 1.1940 1.2469 1.2956 1.3133 1.3597 1.3582 1.4968 1.4704 1.4534 1.4917 1.5627 1.5682 1.4456 1.5184 1.0860 1.0863 1.0899 1.0895 1.0914 1.0923 1.0835 1.0838 1.0981 1.0989 10.9600 1.0662 1.0660 1.0613 1.0614 1.0626 1.0628 1.0619 1.0620 1.0637 1.0638 1.0829 1.0831 1.0959 1.0958 1.0979 1.0979 1.1009 1.1008 1.1024 1.1024 1.1028 1.1028
irintensity: 0.0092 1.0953 0.8312 1.0294 0.0108 0.4021 2.2077 0.4482 1.4602 0.1033 9.4145 3.9487 2.6559 1.6613 11.5576 2.5555 1.7096 0.0149 0.3346 5.8478 1.0208 1.3883 0.4691 5.4657 16.8302 5.9871 1.7671 0.7444 0.9795 4.1539 37.9204 12.7545 6.3047 7.5527 3.4864 26.4870 140.3530 7.1941 0.4167 2.6062 186.6882 2.5734 0.0249 2.1933 0.5995 0.3399 13.8218 3.7081 5.2485 0.8580 0.1423 1.6870 1071.4409 0.7485 96.5586 0.0085 0.6608 5.2832 1.3165 1.7232 2.4634 2.8965 27.3791 2.9145 1.9344 0.0119 0.7396 3.3002 0.1021 0.4203 1.0486 4.1777 1.7789 1.7579 1.8053 0.1128 2.2232 8.0522 6.0688 0.7940 28.5650 7.8636 30.8848 0.7127 5.5848 198.9626 62.3931 3.2295 1.5206 69.6219 1.1464 65.3900 4.3215 14.3306 7.1312 26.6573 24.5553 17.8290 114.6442 7.8738 7.3779 118.3737 0.5322 87.4411 1.0243 36.8770 7.0724 133.0790
temp: 298.150 k
press: 1.00000 atm
elementType: 8 8 8 6 6 6 6 6 6 6 6 6 6 6 6 6 1 1 1 1 1 1 1 1 1 1 1 1 1 1 1 1 1 1 1 1 1 1
symmnumber: 1
zpe: 874502.7 jmol-1
zpe.correction: 0.333080 hartree
zpe.thermalcorrener: 0.348843 hartree
zpe.thermalcorrenthalpy: 0.349787 hartree
zpe.thermalcorrgfe: 0.289063 hartree
zpe.sumelectzpe: -732.995732 hartree
zpe.sumelectthermal: -732.979970 hartree
zpe.sumelectthermalent: -732.979026 hartree
zpe.sumelectthermalfe: -733.039750 hartree
dipole: 0.0001 0.2913 -0.1976
dipole: 0.3520
quadrupole: -78.7110 -98.1092 -99.8304
quadrupole: 0.0002 -0.0001 -3.8324
quadrupole: 13.5059 -5.8923 -7.6136 0.0002 -0.0001 -3.8324
hfenergy: -733.3288128 hartree
pointgroup: C01 [X(C13H22O3)]
dipole: -0.0000817 0.1369498 0.020538 debye
polarizability: 194.6291871|0.016795|127.7256888|0.010161|-7.2997525|121.4113381 unknown
InChI: InChI=1S/C13H22O3/c14-13(15-11-7-3-1-4-8-11)16-12-9-5-2-6-10-12/h11-12H,1-10H2
charge 0 multiplicity 1
38 atoms
O  -1.114443 -0.270783 0.723005
O  1.113783 -0.270129 0.723273
O  -0.000236 0.211268 -1.292366
C  -2.444686 -0.093185 0.036978
C  2.44411 -0.092048 0.037564
C  -3.449658 -0.914958 0.853247
C  -2.812551 1.399488 -0.01464
C  2.811315 1.400781 -0.014296
C  3.449278 -0.91315 0.854283
C  -4.877282 -0.738073 0.276298
C  -4.239342 1.575511 -0.595084
C  4.238172 1.577317 -0.594411
C  4.876963 -0.735768 0.277649
C  -5.277576 0.756075 0.208746
C  5.276597 0.758544 0.209854
C  -0.000302 -0.074298 -0.069307
H  -2.345864 -0.489227 -0.992825
H  2.345763 -0.488377 -0.992172
H  -3.422624 -0.567332 1.904537
H  -3.151793 -1.979637 0.851737
H  -2.074154 1.947119 -0.627972
H  -2.774114 1.809285 1.014156
H  2.772408 1.810771 1.014406
H  2.072828 1.947949 -0.627936
H  3.151885 -1.977962 0.852981
H  3.42183 -0.565259 1.905476
H  -5.598697 -1.304281 0.895328
H  -4.920625 -1.174242 -0.743247
H  -4.249566 1.243366 -1.653812
H  -4.5085 2.648697 -0.596111
H  4.506845 2.650624 -0.595625
H  4.248816 1.244921 -1.653059
H  4.920757 -1.172131 -0.741795
H  5.598483 -1.301513 0.896976
H  -6.281861 0.861794 -0.244866
H  -5.344419 1.162436 1.239124
H  6.280939 0.864627 -0.243549
H  5.343023 1.165181 1.240154
