program: Gaussian 09
title: 000138228
version: EM64L-G09RevD.01
frameworkgroup: C1[X(C7H6N2O2)]
method: RPBEPBE
basis: SDD
operation: Freq
keyword: #pfreq=noraman
keyword: PBEPBE/SDD
title: #p freq=noraman PBEPBE/SDD
converged: NO NO NO NO
title: Mulliken charges:
elementType: O O N N C C C C C C C H H H H H H
charge: -0.256478 -0.133603 -0.070327 -0.046053 0.114866 0.041474 0.364660 -0.435632 -0.257000 -0.306744 -0.535552 0.274248 0.265854 0.264105 0.231473 0.231472 0.253238
chargesum: 0.00000
title: Mulliken charges with hydrogens summed into heavy atoms:
elementType: O O N N C C C C C C C
charge: -0.256478 -0.133603 -0.070327 -0.046053 0.114866 0.041474 0.364660 -0.161383 0.008853 -0.042639 0.180631
polarizability: 1.44825874e+02 -3.51169163e+00 9.90771910e+01 2.11882935e-04 -1.22376693e-03 4.35413066e+01
1716.lowfreq: -7.7051 -2.4314 -2.3440 -0.0006 0.0005 0.0006 94.6208 156.5780 198.1246
frequency: 94.5645 156.5724 198.1222 226.0671 238.7987 352.5363 366.8111 432.5617 439.1248 499.6740 563.0174 582.4297 625.5233 695.6134 723.7831 735.7779 791.8628 819.4481 828.4411 835.7664 930.9826 938.8730 971.4072 977.2520 1113.5426 1129.3483 1153.4252 1186.6867 1253.5271 1291.4553 1323.1503 1385.6350 1433.1980 1466.0868 1469.5431 1491.6397 1501.6343 1532.3955 1626.8397 2971.5855 3062.6295 3143.6278 3168.1054 3190.2828 3194.9341
redmass: 3.9153 3.8225 3.6406 1.2813 4.0143 6.7501 6.5569 2.8933 6.8644 4.7718 10.2484 6.6516 3.7933 11.4957 6.6951 3.8663 5.9712 1.5188 1.6791 12.8575 4.8494 8.7733 1.3001 4.3658 1.2642 1.2807 1.3631 2.8154 1.8247 4.0297 3.7966 2.7005 1.2509 1.0484 1.1072 4.9037 5.5366 7.9676 6.7600 1.0329 1.1043 1.1001 1.0879 1.0986 1.0928
irintensity: 1.3566 9.0076 6.0994 0.5447 0.9233 1.4082 0.4449 5.7608 1.0536 6.0308 0.1036 4.9287 7.8414 8.8543 0.0053 0.2886 27.6651 20.7962 66.3233 8.7715 3.9140 8.9679 0.0004 38.2531 0.0780 19.2233 2.1917 146.8895 1.6697 48.0451 28.7610 15.2126 8.9051 16.2299 31.2638 9.2692 73.6394 1.2214 108.8829 40.5758 37.9999 17.6823 0.0789 2.9623 3.9486
temp: 298.150 k
press: 1.00000 atm
elementType: 8 8 7 7 6 6 6 6 6 6 6 1 1 1 1 1 1
symmnumber: 1
zpe: 317694.0 jmol-1
zpe.correction: 0.121003 hartree
zpe.thermalcorrener: 0.129724 hartree
zpe.thermalcorrenthalpy: 0.130668 hartree
zpe.thermalcorrgfe: 0.087241 hartree
zpe.sumelectzpe: -529.412374 hartree
zpe.sumelectthermal: -529.403654 hartree
zpe.sumelectthermalent: -529.402709 hartree
zpe.sumelectthermalfe: -529.446136 hartree
dipole: -5.5986 0.6118 -0.0001
dipole: 5.6320
quadrupole: -67.9634 -59.8289 -64.5703
quadrupole: 9.2474 -0.0003 -0.0001
quadrupole: -3.8425 4.2920 -0.4494 9.2474 -0.0003 -0.0001
hfenergy: -529.5333772 hartree
pointgroup: C01 [X(C7H6N2O2)]
dipole: 2.210233 -0.156721 -0.0000347 debye
dipolederiv: -1.6410665 -0.2084777 -0.0000083 -0.3625666 -0.4170373 0.0000013 0.0000308 -0.0000041 -0.2972188 -0.5281327 0.2533663 -0.0001091 0.2694705 0.0790982 0.0000563 0.0004689 -0.0001327 -0.0982449 0.0186304 -0.311678 0.0000007 0.1293255 -0.1482927 -0.0001256 -0.0003149 0.0001249 -0.1408792 0.2091132 -0.0185426 0.0001002 -0.33336 -0.156731 0.0000815 -0.0002985 0.0000455 -0.1196609 0.49249 0.0669558 0.0000328 0.1884427 -0.1699005 0.0000382 0.000102 0.0000079 0.1128733 -0.2450179 -0.029675 -0.0000045 -0.2126175 -0.0046701 -0.0000573 0.0000076 -0.0000442 0.0806016 1.5611377 0.1535638 0.0000057 0.0912034 0.1278004 -0.0000092 -0.000041 0.0000218 0.1227262 -0.4609547 0.0128211 -0.0000144 0.2575237 -0.0623849 0.0000001 0.0000267 -0.0000306 -0.2269876 0.1403976 -0.0910409 -0.0000102 -0.0329856 0.1432072 0.0000122 0.0000381 0.0000308 -0.1215366 -0.2419812 -0.035503 -0.0000001 -0.2661203 0.1318665 0.0000058 -0.0000561 -0.0000002 -0.1388853 0.5315846 0.1313791 0.0000019 0.5037462 0.416652 -0.0000024 0.0000076 0. 0.3162997 0.0571805 -0.0339596 0.0000003 -0.080696 0.0060961 0.0000026 0.0000184 -0.000002 0.1900853 0.0714953 -0.0550325 -0.000004 -0.0117703 -0.0143881 -0.0000073 0.0000099 -0.0000173 0.1743257 0.0502252 0.082725 0.0000043 0.0536681 0.03032 -0.000003 0.0000065 -0.0000094 0.1641262 0.060029 0.0445476 0.0875907 -0.1135921 -0.0243827 -0.0784585 0.0204412 -0.0892227 -0.0730855 0.0600301 0.044544 -0.0875792 -0.1135982 -0.0243939 0.0784634 -0.0204411 0.0892311 -0.0730896 -0.1351608 -0.0059934 -0.0000069 0.0339266 0.0871409 0.0000016 -0.0000061 0.0000011 0.1285505 unknown
polarizability: 145.0266802|-1.7621152|98.8763851|-0.0002583|0.0012148|43.5413066 unknown
InChI: InChI=1S/C7H6N2O2/c1-10-5-2-3-6-7(4-5)9-11-8-6/h2-4H,1H3
charge 0 multiplicity 1
17 atoms
O  2.871088 -0.170175 -0.000022
O  -2.972658 0.755474 0.000313
N  -1.77691 1.582584 -0.000069
N  -2.654019 -0.654044 -0.000148
C  -0.758205 0.676218 -0.000001
C  -1.294774 -0.678775 -0.000019
C  1.47834 -0.203802 0.000007
C  0.650433 0.920701 -0.000007
C  -0.411897 -1.811133 -0.000044
C  0.949308 -1.560419 -0.000017
C  3.517578 1.149106 0.000023
H  1.030339 1.943491 -0.000041
H  -0.812261 -2.827786 -0.000113
H  1.67982 -2.374444 -0.000062
H  3.242121 1.723323 0.904981
H  3.242181 1.723356 -0.904932
H  4.596017 0.941025 0.000051
