program: Gaussian 09
title: 000138224
version: EM64L-G09RevD.01
frameworkgroup: C1[X(C7H15Cl)]
method: RPBEPBE
basis: SDD
operation: Freq
keyword: #pfreq=noraman
keyword: PBEPBE/SDD
title: #p freq=noraman PBEPBE/SDD
converged: YES YES NO NO
title: Mulliken charges:
elementType: Cl C C C C C C C H H H H H H H H H H H H H H H
charge: -0.120721 -0.003167 -0.346072 -0.351728 -0.353765 -0.663205 -0.683011 -0.697125 0.191639 0.222271 0.216232 0.194339 0.198993 0.190074 0.237723 0.204081 0.236348 0.250544 0.233913 0.203679 0.215953 0.208454 0.214550
chargesum: 0.00000
title: Mulliken charges with hydrogens summed into heavy atoms:
elementType: Cl C C C C C C C
charge: -0.120721 -0.003167 0.067837 0.058843 0.035302 0.014947 0.005126 -0.058167
polarizability: 9.42349387e+01 -3.15646399e-01 8.75710560e+01 -7.02792184e-01 -6.31284463e-01 7.45791604e+01
1716.lowfreq: -15.5349 -0.0039 -0.0028 -0.0017 7.5539 12.3917 57.6981 66.7811 119.7830
frequency: 57.5208 66.7150 119.7713 140.1935 210.8245 219.1931 241.4396 262.0858 268.4386 305.0563 325.8206 351.5025 435.6768 485.0688 511.6371 730.5670 777.0742 813.1325 894.7630 903.5402 931.8859 953.3991 999.5665 1037.5177 1065.9990 1083.0830 1100.1183 1151.8776 1196.2150 1217.9558 1250.4583 1270.6869 1289.3584 1297.6653 1337.9600 1360.0593 1382.1857 1388.8494 1396.5966 1440.7872 1455.0778 1462.5949 1466.1914 1469.2768 1475.7584 1476.6814 1485.6021 1487.8013 2950.5408 2962.9996 2973.2612 2976.9459 2978.1935 2982.6415 3006.3641 3021.1297 3048.7217 3070.3486 3072.8622 3074.8021 3080.7832 3104.5984 3112.6287
redmass: 1.8307 2.7708 2.7712 2.3928 1.0718 1.1333 1.7024 1.6190 2.4006 2.2767 3.1335 3.2212 2.6927 3.0232 3.0728 1.0868 1.2809 2.8638 1.7082 1.4449 1.4170 1.6313 1.2930 2.5615 1.4620 2.1907 2.2493 1.9780 2.3379 1.4809 2.2969 1.3970 1.1724 1.2018 1.4773 1.6105 1.2217 1.2171 1.2067 1.0697 1.0641 1.0501 1.0607 1.0616 1.0428 1.0667 1.0520 1.0815 1.0634 1.0589 1.0376 1.0475 1.0512 1.0398 1.0974 1.0953 1.1032 1.1007 1.0995 1.0947 1.0941 1.1010 1.1002
irintensity: 0.2807 0.9271 0.0566 0.8195 0.2100 0.0668 0.0435 0.3079 1.0846 0.3608 2.3637 7.3128 2.3614 0.1569 26.2213 11.8279 0.3021 6.2268 5.3177 2.8271 0.9088 5.2524 1.1511 3.3128 10.0431 1.4696 10.6427 38.6691 4.9917 13.3744 25.1137 7.9224 3.0361 4.0453 6.9984 0.6546 31.0998 11.1047 15.2918 0.3051 3.9616 4.7063 5.6514 3.5984 12.1386 1.7685 24.5958 9.8930 14.9853 28.9637 27.8590 4.0235 60.2022 29.7205 9.5387 6.3680 27.6128 82.8874 51.6510 17.7193 35.6647 20.3503 27.6109
temp: 298.150 k
press: 1.00000 atm
elementType: 17 6 6 6 6 6 6 6 1 1 1 1 1 1 1 1 1 1 1 1 1 1 1
symmnumber: 1
zpe: 535137.8 jmol-1
zpe.correction: 0.203823 hartree
zpe.thermalcorrener: 0.214832 hartree
zpe.thermalcorrenthalpy: 0.215776 hartree
zpe.thermalcorrgfe: 0.167215 hartree
zpe.sumelectzpe: -735.133731 hartree
zpe.sumelectthermal: -735.122722 hartree
zpe.sumelectthermalent: -735.121778 hartree
zpe.sumelectthermalfe: -735.170339 hartree
dipole: -0.5967 -2.5907 0.1829
dipole: 2.6648
quadrupole: -59.4877 -60.4030 -58.0909
quadrupole: -3.9874 0.6141 -0.0719
quadrupole: -0.1605 -1.0758 1.2363 -3.9874 0.6141 -0.0719
hfenergy: -735.3375543 hartree
pointgroup: C01 [X(C7H15Cl1)]
dipole: 0.1544549 -0.9570988 -0.3991082 debye
dipolederiv: -0.3167523 0.0448516 0.0202562 0.0577703 -0.691045 -0.1786278 0.0230149 -0.1842185 -0.3474428 0.3714412 -0.0520575 -0.0195559 -0.1325817 0.8454251 0.2257391 -0.0020986 0.2210061 0.4395264 -0.0923392 -0.0234837 -0.0153837 0.0724582 -0.0116615 0.0057022 -0.0335146 0.0037904 0.0303499 -0.0740303 -0.0159146 -0.0045481 0.031472 0.0542918 0.0470131 -0.017695 0.0633072 0.1353001 0.0657276 -0.0136726 0.0082557 -0.0527557 0.1528933 0.038451 0.0328954 0.0359504 0.1349329 -0.1356563 -0.0401668 0.0622657 -0.0349458 -0.0605265 0.0246915 0.0391347 0.0014263 -0.0337436 -0.0318968 0.0056185 -0.0008663 0.0237882 -0.0576955 0.0082119 -0.0198061 0.0337375 -0.1663816 -0.0688236 -0.0392121 0.029355 -0.0174795 0.0600398 0.0226727 0.0056184 0.0234497 0.0773217 0.0276671 0.0358434 0.0074591 -0.0206477 -0.1622454 -0.0528843 -0.000998 -0.0702583 0.0641774 0.0441125 0.0096539 -0.015606 -0.0149749 0.0819393 0.0079921 -0.0049529 0.0368985 -0.1512752 0.0793608 0.0170239 -0.0029635 -0.008032 -0.1172143 -0.0130041 -0.0045522 -0.0357656 0.0597399 0.0495091 -0.0064592 0.0052278 -0.0086021 0.0577367 -0.0138466 -0.0038789 0.0042726 -0.189192 0.0239254 -0.004286 0.037984 0.0000516 0.0676833 -0.0188481 -0.002855 0.0076125 -0.1999648 0.023596 -0.0247959 -0.0028307 0.0189063 -0.2062393 -0.0186043 0.0011839 -0.0502244 0.0638405 -0.1224584 0.0407842 -0.0292819 0.0896669 0.0628661 0.0240608 -0.0527229 0.0341504 0.0878183 0.0863722 0.0004243 0.0204582 -0.017244 -0.137729 -0.0813045 0.0152477 -0.0898805 0.0554364 0.0953621 -0.0076204 -0.0502626 -0.0061868 0.0916224 0.0155762 -0.0044137 0.0475724 -0.1300439 0.0132127 -0.1034923 0.0833257 -0.1030202 0.0250372 0.0595767 0.074601 0.0325582 0.0455189 -0.1246166 0.0672786 -0.0833945 0.0652013 0.0863315 0.0258375 -0.0325412 0.0024425 0.0725997 0.1090229 0.0329039 0.0145207 0.0254613 -0.1060168 -0.1008749 0.0124929 -0.0923447 0.0080379 -0.1875964 0.0590026 -0.069201 0.0839562 0.0590345 0.0436183 -0.0950354 0.0411439 0.0553598 0.0816479 -0.0157902 -0.0145657 -0.0187077 0.0769673 -0.0345515 0.0529091 -0.0136872 -0.1863248 0.0832126 0.0335663 0.0193518 -0.0335542 -0.1714948 -0.0365968 0.0179666 -0.0529392 0.0744088 unknown
polarizability: 94.2254532|0.0989283|85.8353712|-0.9016219|4.4583053|76.3243307 unknown
InChI: InChI=1S/C7H15Cl/c1-4-5-6-7(2,3)8/h4-6H2,1-3H3
charge 0 multiplicity 1
23 atoms
Cl -1.635109 1.679129 0.7222
C  -1.463575 -0.111377 -0.051191
C  -0.075463 -0.641998 0.367363
C  1.1524 0.101992 -0.198501
C  2.479608 -0.443756 0.377382
C  -2.600872 -0.92956 0.578953
C  -1.641927 0.072128 -1.564789
C  3.719468 0.274921 -0.196173
H  -0.035074 -1.707358 0.049408
H  -0.0261 -0.643974 1.473754
H  1.061631 1.180425 0.036856
H  1.178019 0.014786 -1.303177
H  2.467368 -0.337715 1.481231
H  2.552342 -1.531492 0.16997
H  -3.582499 -0.475559 0.363307
H  -2.591711 -1.955712 0.161161
H  -2.480943 -0.998315 1.673358
H  -0.905282 0.778991 -1.977997
H  -2.652056 0.450021 -1.795754
H  -1.510326 -0.9049 -2.070918
H  4.65541 -0.126551 0.233734
H  3.774142 0.156629 -1.294941
H  3.684049 1.358745 0.022264
