program: Gaussian 09
title: 000138223
version: EM64L-G09RevD.01
frameworkgroup: C1[X(C6H10N2)]
method: RPBEPBE
basis: SDD
operation: Freq
keyword: #pfreq=noraman
keyword: PBEPBE/SDD
title: #p freq=noraman PBEPBE/SDD
converged: NO YES NO NO
title: Mulliken charges:
elementType: N N C C C C C C H H H H H H H H H H
charge: -0.279526 -0.018644 -0.076377 -0.391342 -0.391365 -0.422991 -0.422988 -0.204428 0.240630 0.229969 0.213670 0.213683 0.229967 0.178089 0.225908 0.225916 0.178094 0.271738
chargesum: 0.00000
title: Mulliken charges with hydrogens summed into heavy atoms:
elementType: N N C C C C C C
charge: -0.007789 -0.018644 0.164253 0.052297 0.052284 -0.018994 -0.018979 -0.204428
polarizability: 9.11713743e+01 -6.76075560e-03 6.79773579e+01 2.29817684e+00 -9.18759592e-04 5.61601340e+01
1716.lowfreq: -14.6134 -4.5472 -2.0393 -0.0011 -0.0008 -0.0006 111.1121 146.9504 242.1644
frequency: 111.1103 146.9493 242.1608 261.1925 357.6324 365.3695 438.3808 507.3428 520.6082 532.5406 667.8723 801.6429 810.7337 868.9921 908.0511 951.4734 980.0820 1052.8881 1061.1685 1088.1368 1101.3365 1140.8732 1170.2885 1208.6005 1242.9538 1270.1341 1279.7333 1295.3439 1316.6790 1321.8899 1351.9755 1386.8178 1444.7547 1451.3340 1459.9809 1466.2159 1472.1655 2187.7014 2838.9855 2846.9960 2958.0345 3008.6789 3010.3158 3043.0668 3046.6658 3076.2827 3080.8546 3466.0659
redmass: 4.0566 5.6854 1.7744 3.0182 4.4952 2.0866 3.0965 1.7464 2.4832 7.2029 1.8952 2.5338 1.4710 2.9076 1.9818 2.6323 1.4892 2.4787 1.7875 2.7222 2.3064 1.3366 3.1250 1.1683 1.3416 1.2188 1.2563 1.2191 1.2330 1.3450 1.5148 1.4277 1.2030 1.1890 1.0881 1.0740 1.1008 12.5598 1.0723 1.0700 1.0813 1.0597 1.0610 1.0872 1.0889 1.1047 1.1043 1.0755
irintensity: 2.9594 3.2550 0.3101 1.6800 5.6889 4.7175 2.4270 20.2708 68.6410 0.0891 71.1282 0.7662 0.4456 3.4675 3.5776 5.9081 3.0148 9.0452 1.2323 0.1569 6.6932 12.5739 13.6543 2.4726 0.8547 2.1197 1.2438 0.8351 21.4526 8.9086 2.4676 2.9043 11.1238 0.5584 19.9367 0.8978 7.1221 18.5262 52.2780 184.0966 11.8562 21.5332 15.4679 65.4276 22.5916 13.0681 48.0539 0.5835
temp: 298.150 k
press: 1.00000 atm
elementType: 7 7 6 6 6 6 6 6 1 1 1 1 1 1 1 1 1 1
symmnumber: 1
zpe: 404451.8 jmol-1
zpe.correction: 0.154048 hartree
zpe.thermalcorrener: 0.161572 hartree
zpe.thermalcorrenthalpy: 0.162516 hartree
zpe.thermalcorrgfe: 0.122349 hartree
zpe.sumelectzpe: -343.489966 hartree
zpe.sumelectthermal: -343.482441 hartree
zpe.sumelectthermalent: -343.481497 hartree
zpe.sumelectthermalfe: -343.521664 hartree
dipole: 4.8347 -0.0001 1.5381
dipole: 5.0734
quadrupole: -61.9718 -45.2707 -49.3818
quadrupole: 0.0016 -0.2425 0.0004
quadrupole: -9.7637 6.9374 2.8263 0.0016 -0.2425 0.0004
hfenergy: -343.6440133 hartree
pointgroup: C01 [X(C6H10N2)]
dipole: 1.9036235 -0.0002238 0.6003377 debye
dipolederiv: -0.2933021 0.0000159 0.0676173 0.0000198 -0.556562 0.0000085 0.1626239 0.0000038 -0.6552524 -0.4085289 -0.0003514 0.01934 0.0000011 -0.2256952 -0.0000069 -0.0499325 -0.0000448 -0.233625 -0.0334472 0.0000336 -0.0318565 -0.0001369 0.1092786 -0.0000037 -0.03262 -0.0000069 0.2611552 -0.0350592 -0.0432411 -0.0245539 -0.0999097 0.1136982 -0.0312741 -0.0811585 0.0123603 0.1171293 -0.0351744 0.0432456 -0.0246046 0.0999933 0.1137292 0.0312755 -0.0813073 -0.0123532 0.1170778 0.2099486 0.1861978 -0.0460741 0.1615204 0.3757967 -0.1276753 0.0095854 -0.1230028 0.445688 0.2100037 -0.1862127 -0.0460494 -0.1616519 0.375766 0.1276694 0.0096645 0.1230099 0.445647 0.290733 0.0002867 0.0437316 0.000195 -0.1150764 0.0000354 0.1277577 0.0000396 -0.0635815 0.0351152 -0.0000052 -0.0416661 -0.0000357 0.0593463 -0.0000227 0.0057911 -0.0000055 -0.1104408 0.051355 0.0254512 -0.0305762 0.0334515 0.0731518 0.024241 -0.0382284 -0.0369188 -0.1227725 0.0221102 -0.0833134 0.0379437 -0.0696727 -0.1088613 0.0558095 0.0472631 0.088081 0.0502848 0.0220796 0.0833345 0.0379204 0.0696575 -0.1088847 -0.0557615 0.0472445 -0.0880257 0.0503407 0.0513761 -0.0254675 -0.0305382 -0.0334689 0.0731597 -0.0243026 -0.0381806 0.036865 -0.1227616 0.0022108 -0.0568823 -0.0004776 -0.0367209 -0.0175241 -0.0021482 -0.0323307 0.15064 -0.299666 -0.0258242 0.1031118 0.0385829 0.0838594 -0.1123034 -0.0428197 0.0627214 -0.0713202 0.0476332 -0.0258393 -0.1030936 0.0385871 -0.0838191 -0.1122722 0.0428311 0.0627049 0.0713278 0.0476312 0.0022178 0.0568945 -0.0004714 0.0367314 -0.0175245 0.002127 -0.032308 -0.1506598 -0.2996419 -0.0399747 -0.0000045 -0.006855 -0.0000135 0.0807774 0.0000172 -0.1492906 0.0000102 0.3251545 unknown
polarizability: 91.1827454|-0.0094063|67.9773595|2.2098204|-0.0024605|56.1487614 unknown
InChI: InChI=1S/C6H10N2/c7-5-6-1-3-8-4-2-6/h6,8H,1-4H2
charge 0 multiplicity 1
18 atoms
N  2.22463 -0.000004 -0.358785
N  -3.185981 0.000747 -0.137051
C  -0.575315 0.000044 0.416676
C  0.123513 -1.280177 -0.136482
C  0.123452 1.280111 -0.136773
C  1.629692 -1.233332 0.197222
C  1.629611 1.233361 0.197072
C  -2.019366 -0.000238 0.117213
H  -0.467094 0.000193 1.523215
H  -0.005032 -1.319283 -1.232997
H  -0.3371 -2.185023 0.300073
H  -0.337239 2.18505 0.299495
H  -0.004944 1.318896 -1.233318
H  1.750017 -1.305805 1.309632
H  2.135692 -2.107592 -0.250105
H  2.135602 2.107595 -0.250309
H  1.749892 1.305937 1.309482
H  3.251071 0.000021 -0.322958
