program: Gaussian 09
title: 000134768
version: EM64L-G09RevD.01
frameworkgroup: C1[X(C22H26Br2N2O3)]
method: RPBEPBE
basis: SDD
operation: Freq
keyword: #p
keyword: freq=noraman
keyword: PBEPBE/SDD
title: #p freq=noraman PBEPBE/SDD
converged: YES YES NO NO
title: Mulliken charges:
elementType: Br Br O O O N N C C C C C C C C C C C C C C C C C C C C C C H H H H H H H H H H H H H H H H H H H H H H H H H H
charge: 0.035137 0.006627 -0.220038 -0.238645 -0.398083 -0.247528 -0.490922 0.066609 -0.472655 -0.425581 -0.406649 -0.402463 -0.385359 -0.490122 -0.658759 0.343325 0.424408 -0.362251 -0.354094 -0.245743 -0.180645 0.050286 0.310164 -0.486477 -0.382429 0.217387 -0.354733 0.153586 -0.544327 0.183403 0.220639 0.220158 0.199756 0.194791 0.208818 0.191701 0.195112 0.202552 0.204224 0.198720 0.242932 0.216639 0.212082 0.258193 0.261692 0.254699 0.378903 0.270773 0.272075 0.275883 0.223745 0.358180 0.249869 0.214909 0.229527
chargesum: 0.00000
title: Mulliken charges with hydrogens summed into heavy atoms:
elementType: Br Br O O O N N C C C C C C C C C C C C C C C C C C C C C C
charge: 0.035137 0.006627 -0.220038 -0.238645 -0.039904 -0.247528 -0.112019 0.250012 -0.031858 -0.031034 -0.006130 -0.004799 0.017584 -0.030550 0.073208 0.343325 0.424408 -0.107552 -0.354094 -0.245743 0.090129 0.050286 0.310164 -0.214402 -0.106546 0.217387 -0.130988 0.153586 0.149978
polarizability: 4.38437941e+02 2.89399381e+01 2.91543933e+02 5.51835111e-01 1.20399733e+01 2.18935128e+02
1716.lowfreq: -7.2476 -0.0004 0.0002 0.0005 1.9588 3.7518 15.1085 18.4817 24.2125
frequency: 15.0129 18.2731 24.0244 31.1986 36.2901 37.8339 71.7602 79.8675 93.8508 105.2214 108.4945 119.1337 124.1984 139.0581 148.1604 168.6860 178.1253 197.1290 203.1143 208.5675 223.4819 247.3225 252.1471 260.6564 277.2593 296.0694 312.9847 323.9912 327.2938 328.5107 348.8689 372.9483 380.8510 383.3671 391.9571 430.2263 433.3592 451.5193 456.1151 474.9020 490.8441 496.7712 511.0273 529.5287 545.1819 550.5247 580.8348 624.8981 649.3525 678.6485 703.9438 716.0125 749.5507 753.5535 777.9819 785.6103 789.4363 802.8101 817.1720 834.3773 852.4812 871.1975 871.8803 877.5459 884.0972 889.5680 896.2047 897.7728 926.3281 948.0015 956.4328 986.5413 990.5154 1003.8654 1023.6412 1052.9352 1058.9329 1074.1134 1077.7227 1086.2105 1103.6856 1112.3482 1112.5730 1114.6929 1126.8646 1145.8425 1149.8363 1152.7241 1164.9662 1184.5245 1200.6206 1214.1829 1224.7013 1243.1988 1249.3636 1255.4595 1262.8995 1269.9087 1277.3442 1289.4111 1296.3223 1299.9355 1313.8547 1331.9272 1333.7827 1340.8649 1345.1247 1347.0631 1360.9468 1367.8515 1387.1186 1394.8925 1413.8185 1432.7464 1441.6233 1445.1120 1455.5010 1461.7959 1463.2548 1464.2561 1466.1058 1470.7830 1471.2417 1477.7156 1480.8483 1489.9836 1508.1850 1524.3824 1557.8957 1587.8332 1597.6210 1611.5344 1641.7640 2844.5948 2865.1236 2902.7254 2929.6542 2955.9178 2967.7771 2969.3302 2970.1755 2971.8460 2976.9985 3028.3081 3031.9124 3033.8731 3038.6262 3042.6353 3044.2823 3053.1254 3058.1914 3109.2168 3116.8919 3126.8895 3146.9933 3165.0365 3169.2414 3182.2626 3570.0149
redmass: 7.9464 5.7454 3.6834 4.4576 5.6731 3.9237 5.7126 4.8490 4.3358 10.1596 5.2261 4.0616 4.2195 10.8610 7.6265 5.4617 3.0509 3.9141 3.7954 2.4471 2.0262 2.6404 2.7680 1.6175 2.6635 2.1297 5.3036 2.3698 4.7155 4.1031 7.6216 2.8935 1.2118 2.8769 3.4248 3.3753 4.5737 2.8989 3.3651 2.4155 3.4472 4.9334 3.9859 3.9432 3.1604 4.2587 4.6898 6.2823 4.6074 9.1942 5.0862 4.1691 3.8055 5.3543 2.4289 1.4701 5.9126 3.6777 1.5588 3.8523 2.3373 2.2793 1.4986 1.4542 1.8495 2.0875 1.6583 2.5890 2.1597 1.3610 2.2042 2.9773 2.0885 2.5125 2.3617 1.3126 1.7641 2.8723 1.4200 2.1166 1.7557 1.5341 1.2748 2.4874 2.3624 3.0873 1.3112 2.3336 1.2425 1.5706 2.4879 1.6192 1.7742 1.3168 2.2361 1.3053 1.2869 1.8380 2.5472 1.8636 1.4941 1.4404 1.3019 1.4873 1.6578 1.4531 1.5494 2.1718 1.9952 1.5857 3.1022 3.3341 5.9777 1.2426 1.3026 2.3686 1.1249 1.1090 1.0879 1.0955 1.0593 1.0661 1.0810 1.0856 1.0552 1.0648 3.0264 3.5146 6.4626 7.9231 6.2630 5.7680 1.7226 1.0813 1.0794 1.0700 1.0536 1.0336 1.0672 1.0642 1.0594 1.0610 1.0622 1.0926 1.0947 1.0943 1.0982 1.1023 1.1014 1.1007 1.0828 1.1001 1.0899 1.0991 1.0921 1.0901 1.0941 1.0934 1.0660
irintensity: 0.0474 0.0141 0.0781 0.1754 0.0111 0.0265 0.3808 0.1876 5.8319 1.3300 3.2595 1.0977 1.8079 1.7776 0.3267 1.4908 1.3451 2.2908 1.8063 1.5931 0.1930 7.2640 11.8121 1.1166 1.3035 9.5491 3.8678 4.5738 0.6637 1.7649 6.8296 7.1341 89.9035 50.5557 0.2823 1.1214 7.9145 3.3896 1.9377 0.1368 1.4646 5.1088 1.8606 7.8902 7.6901 6.4346 14.5110 19.1337 11.5089 53.1429 26.0563 3.2382 0.7849 48.0440 26.5534 1.6695 16.4707 18.6956 41.8426 23.3862 25.4926 4.8502 30.9873 10.8762 45.2803 1.6269 5.7845 4.0092 0.6504 10.0662 31.1480 38.6041 1.3914 95.8780 30.4387 0.7390 3.6664 25.0979 1.8796 336.9777 12.4821 2.4751 0.1312 2.4555 23.5549 34.4786 19.4275 24.5577 15.9123 18.8182 91.0826 7.6749 20.7125 0.6065 57.3753 9.8460 9.7502 23.8013 513.1642 74.3542 33.2166 53.4066 0.3730 11.7459 3.8970 8.1152 1.8018 14.1685 72.5019 34.7583 5.8885 8.5632 18.3168 32.6450 11.9078 256.3108 24.5948 21.1731 10.4381 4.0471 21.0265 22.5750 23.9132 6.2262 8.8514 2.4831 83.1989 189.6200 94.7226 45.0707 21.5474 78.0060 50.9637 575.7729 327.1697 41.9154 50.2922 51.0890 27.5746 33.5056 47.5043 7.5649 38.6719 11.1218 65.4217 75.0064 7.7120 94.7280 21.7751 67.5242 16.4188 15.9854 22.9744 21.8534 3.9050 5.4073 1.3486 0.2367 62.6435
temp: 298.150 k
press: 1.00000 atm
elementType: 35 35 8 8 8 7 7 6 6 6 6 6 6 6 6 6 6 6 6 6 6 6 6 6 6 6 6 6 6 1 1 1 1 1 1 1 1 1 1 1 1 1 1 1 1 1 1 1 1 1 1 1 1 1 1
symmnumber: 1
zpe: 1150845.6 jmol-1
zpe.correction: 0.438334 hartree
zpe.thermalcorrener: 0.467378 hartree
zpe.thermalcorrenthalpy: 0.468322 hartree
zpe.thermalcorrgfe: 0.375250 hartree
zpe.sumelectzpe: -1213.859436 hartree
zpe.sumelectthermal: -1213.830392 hartree
zpe.sumelectthermalent: -1213.829448 hartree
zpe.sumelectthermalfe: -1213.922520 hartree
dipole: -4.7531 5.4870 0.1597
dipole: 7.2611
quadrupole: -198.1040 -183.5246 -181.6840
quadrupole: 3.9459 9.8794 1.1572
quadrupole: -10.3331 4.2462 6.0869 3.9459 9.8794 1.1572
hfenergy: -1214.2977695 hartree
pointgroup: C01 [X(C22H26Br2N2O3)]
dipole: 1.3862807 2.4165448 -0.6321336 debye
polarizability: 438.1539761|15.1153758|273.7365053|32.5056483|-27.0325553|237.0265208 unknown
InChI: InChI=1S/C22H26Br2N2O3/c1-26(17-6-4-3-5-7-17)13-15-10-16(23)12-18(24)21(15)25-22(28)14-8-9-19(27)20(11-14)29-2/h8-12,17,25,27H,3-7,13H2,1-2H3
charge 0 multiplicity 1
55 atoms
Br -2.278656 -3.919168 -0.075797
Br -7.110671 -0.874953 -0.807787
O  -1.032758 -2.159302 2.182528
O  4.170089 -0.745622 -0.763281
O  5.31163 -0.900498 1.646654
N  -0.998696 1.758256 0.012605
N  -0.971922 -0.92154 0.165796
C  -0.114679 2.81353 -0.609173
C  1.085872 3.156715 0.308155
C  0.413115 2.343201 -1.992259
C  2.028288 4.199498 -0.341216
C  1.348879 3.38919 -2.644856
C  2.538453 3.732383 -1.721554
C  -2.284579 1.577512 -0.728024
C  -1.28515 1.967773 1.461238
C  -3.030291 0.266338 -0.443602
C  -2.359451 -0.961855 -0.113969
C  -4.427483 0.27578 -0.647892
C  -3.128084 -2.162072 -0.140654
C  -5.163636 -0.919514 -0.562824
C  -4.525755 -2.151283 -0.333164
C  -0.375678 -1.546293 1.289725
C  1.112298 -1.373009 1.363058
C  1.903795 -1.118288 0.209038
C  1.738707 -1.491151 2.624991
C  3.303084 -0.970403 0.311773
C  3.133831 -1.330294 2.737625
C  3.923032 -1.065046 1.596369
C  3.586276 -0.75362 -2.105964
H  -0.711659 3.750492 -0.759361
H  1.648684 2.224329 0.519407
H  0.732646 3.554505 1.276364
H  -0.417367 2.121148 -2.687978
H  0.967221 1.39478 -1.836355
H  2.878272 4.395119 0.339466
H  1.485592 5.160434 -0.459918
H  0.774356 4.313462 -2.861582
H  1.709548 3.004709 -3.618237
H  3.170705 4.514568 -2.183375
H  3.178716 2.835203 -1.591934
H  -2.055395 1.598239 -1.808829
H  -2.977451 2.430182 -0.534555
H  -1.729127 2.968335 1.663926
H  -0.368845 1.852308 2.059461
H  -2.002361 1.198497 1.794391
H  -4.933802 1.219501 -0.875097
H  -0.575242 0.038962 -0.057889
H  -5.088897 -3.087081 -0.325832
H  1.415292 -1.086887 -0.76906
H  1.119701 -1.716189 3.498412
H  3.619166 -1.415082 3.718902
H  5.637326 -1.019186 2.574195
H  4.437635 -0.607593 -2.786464
H  2.858811 0.072309 -2.2369
H  3.091714 -1.719927 -2.324802
