program: Gaussian 09
title: 000134739
version: EM64L-G09RevD.01
frameworkgroup: C1[X(C10H15N5O9P2)]
method: RPBEPBE
basis: SDD
operation: Freq
keyword: #p
keyword: freq=noraman
keyword: PBEPBE/SDD
title: #p freq=noraman PBEPBE/SDD
converged: YES YES NO NO
title: Mulliken charges:
elementType: P P O O O O O O O O O N N N N N C C C C C C C C C C H H H H H H H H H H H H H H H
charge: 1.421804 1.447694 -0.440651 -0.496207 -0.758255 -0.689090 -0.210790 -0.534635 -0.626809 -0.781657 -0.636658 -0.175376 -0.466057 -0.007765 -0.050773 -0.620882 -0.075291 0.106976 -0.513369 -0.512590 -0.343853 0.380751 -0.245554 -0.160508 0.013840 0.158094 0.289230 0.269468 0.271288 0.257507 0.269301 0.256230 0.272073 0.255055 0.264470 0.407597 0.321046 0.354303 0.438445 0.412959 0.478640
chargesum: 0.00000
title: Mulliken charges with hydrogens summed into heavy atoms:
elementType: P P O O O O O O O O O N N N N N C C C C C C C C C C
charge: 1.421804 1.447694 -0.440651 -0.496207 -0.758255 -0.250645 -0.210790 -0.534635 -0.213850 -0.303017 -0.636658 -0.175376 -0.058460 -0.007765 -0.050773 0.054467 0.213939 0.376444 0.015426 0.012940 0.183275 0.380751 0.018916 -0.160508 0.013840 0.158094
polarizability: 2.53148215e+02 6.52614257e-01 2.46887910e+02 -2.42187349e+01 7.20619891e+00 1.61682860e+02
1716.lowfreq: -5.9042 -3.1237 -0.0013 -0.0013 -0.0009 4.1718 13.7341 16.9292 42.6761
frequency: 13.3615 16.7574 42.6697 49.5816 63.9406 76.9472 85.1812 106.3299 118.5757 125.3709 134.2924 152.8639 171.0519 184.4580 196.9604 209.4384 219.3078 233.3360 257.2985 267.0274 292.7396 298.2608 316.3545 317.8513 325.0374 337.9406 340.2547 342.6724 360.1031 370.2011 376.9670 395.0978 410.0906 431.2487 456.2346 471.1031 518.6719 527.8443 543.2100 577.6917 617.9646 631.6447 645.6452 648.2870 652.2255 677.9723 682.4286 694.3597 719.2243 729.8416 740.6103 748.0242 753.1723 764.8159 778.7335 785.3375 808.0434 829.3666 862.8982 884.7354 907.1340 934.0971 943.1660 962.0461 975.2318 987.6321 1012.1445 1016.9952 1026.5742 1055.3757 1056.8401 1064.9108 1099.8633 1105.7918 1139.6539 1163.1720 1170.6524 1186.4938 1210.1891 1224.1765 1231.2248 1266.5655 1274.8327 1288.5531 1306.4029 1321.0944 1332.1707 1343.4801 1366.2499 1370.6028 1375.6910 1392.4545 1428.9336 1443.8524 1466.7116 1482.1591 1507.9769 1522.0610 1577.3859 1612.8607 1624.0155 1659.6201 2089.1769 3018.7126 3023.1960 3032.3985 3035.6734 3045.6468 3055.1156 3097.6667 3098.5658 3117.2535 3243.0036 3273.5436 3550.7010 3583.6157 3704.7464
redmass: 11.4020 7.2242 6.8319 6.1819 7.8287 9.2642 10.0650 4.9449 7.1064 6.6322 7.1799 7.5384 5.5819 5.7332 4.8064 6.8524 6.2105 6.6568 2.7234 6.9072 4.3932 5.5334 6.6850 2.0919 2.0529 3.5155 3.3868 3.5130 3.1721 5.4056 8.6348 3.1500 5.9230 6.3295 7.2301 8.2746 4.3996 1.1657 12.6533 3.1105 3.6104 5.1440 6.1899 6.5135 7.5142 4.4125 3.3856 6.4041 1.6135 2.3687 3.4791 5.7731 2.8671 2.3181 6.6460 5.6922 4.0104 3.6797 4.6622 2.1398 2.4716 4.1938 3.6048 2.9502 1.9026 2.2733 3.5934 2.5030 2.0319 1.4690 2.4639 2.0600 14.0443 1.9058 3.5299 2.3247 1.8647 1.7712 1.1778 1.1168 1.7803 2.5112 1.5743 1.4199 1.2200 1.6816 1.8440 1.5583 1.3728 2.7166 1.4292 4.0135 4.9101 1.0774 1.0896 1.0956 2.2191 2.1239 2.3048 1.2207 8.5063 3.1685 1.0928 1.0658 1.0617 1.0785 1.0818 1.0738 1.0692 1.1046 1.1037 1.1022 1.0974 1.0841 1.0452 1.0664 1.1055
irintensity: 2.6982 1.1147 8.6278 0.9426 3.4271 0.4503 3.0947 3.6707 4.0892 1.6444 2.6286 4.9611 2.0765 8.4046 2.9744 6.4304 2.2439 2.8516 24.1986 7.3433 16.3493 39.9573 15.0067 102.4177 33.2378 42.8544 18.6845 0.6467 28.9265 10.8834 104.8273 33.5261 63.3407 23.4712 21.3722 4.1309 1.8909 182.3587 44.5155 5.1528 10.6579 11.7222 6.0946 25.2211 62.3357 21.8298 25.4980 1.6722 58.0635 63.6553 84.8306 251.6818 248.4345 160.3091 9.7874 340.1931 98.7214 14.5469 128.8482 84.4707 50.1594 43.4248 78.5811 30.5636 99.4464 74.1084 59.9608 124.9375 150.7966 145.1293 32.2153 15.7233 235.2580 3.1453 21.8588 43.2992 10.2485 3.6406 81.2477 22.6177 92.1888 17.5676 5.2765 9.3184 9.8017 28.4053 51.1418 50.4379 9.9605 191.8115 6.8173 58.1591 4.3318 12.5497 12.5453 21.2143 309.4930 72.6499 28.1771 110.4103 512.2831 343.7850 2333.2724 6.7599 8.2793 0.5487 15.1219 19.0779 405.0133 4.0971 11.4698 11.4913 0.4101 699.6117 101.1097 123.7236 52.1653
temp: 298.150 k
press: 1.00000 atm
elementType: 15 15 8 8 8 8 8 8 8 8 8 7 7 7 7 7 6 6 6 6 6 6 6 6 6 6 1 1 1 1 1 1 1 1 1 1 1 1 1 1 1
symmnumber: 1
zpe: 746444.1 jmol-1
zpe.correction: 0.284306 hartree
zpe.thermalcorrener: 0.309913 hartree
zpe.thermalcorrenthalpy: 0.310858 hartree
zpe.thermalcorrgfe: 0.227661 hartree
zpe.sumelectzpe: -2021.322813 hartree
zpe.sumelectthermal: -2021.297205 hartree
zpe.sumelectthermalent: -2021.296261 hartree
zpe.sumelectthermalfe: -2021.379458 hartree
dipole: 6.4274 3.4801 -8.6186
dipole: 11.3005
quadrupole: -261.9606 -127.5852 -173.2590
quadrupole: -8.6992 18.1326 1.9354
quadrupole: -74.3590 60.0164 14.3426 -8.6992 18.1326 1.9354
hfenergy: -2021.6071187 hartree
pointgroup: C01 [X(C10H15N5O9P2)]
dipole: 1.2840211 -3.7396547 2.032937 debye
polarizability: 225.379475|-38.3552491|204.215087|28.8317224|27.1161101|232.1244232 unknown
InChI: InChI=1S/C10H15N5O9P2/c11-10-13-8-7(9(16)14-10)12-4-15(8)6-2-1-5(23-6)3-22-26(20,21)24-25(17,18)19/h4-6,13,17-18,20H,1-3,11H2
charge 0 multiplicity 1
41 atoms
P  4.109663 -0.176452 0.85405
P  1.570422 0.515122 2.553829
O  0.459817 -1.532278 -0.142521
O  3.86699 -1.325402 -0.392032
O  2.766716 -0.592955 1.960711
O  3.557132 1.270495 0.144337
O  -4.342709 2.50994 -2.543938
O  5.526529 -0.270314 1.523902
O  1.308589 0.190294 4.198165
O  0.201656 -0.150088 1.868801
O  1.980276 2.022182 2.202614
N  -1.617905 -1.112932 -1.335467
N  -2.141308 0.585017 0.442586
N  -2.772648 -0.129181 -3.056001
N  -3.624143 2.366379 -0.307313
N  -2.842758 2.306286 1.898639
C  -0.884643 -2.090312 -0.552427
C  1.595598 -2.283448 -0.79959
C  -0.509203 -3.386576 -1.295374
C  0.877698 -3.077194 -1.910068
C  2.684725 -1.313389 -1.28693
C  -2.208243 0.057004 -0.83559
C  -1.995376 -1.155234 -2.715394
C  -2.922656 0.648043 -1.886836
C  -3.685934 1.896326 -1.662368
C  -2.90163 1.770463 0.627757
H  -1.418803 -2.266553 0.398255
H  2.024556 -2.955179 -0.032981
H  -1.265075 -3.684299 -2.036965
H  -0.423299 -4.201461 -0.556068
H  1.435587 -3.992181 -2.16633
H  0.778316 -2.463776 -2.824085
H  2.288976 -0.289841 -1.417181
H  3.100337 -1.666405 -2.245244
H  -1.680934 -1.952996 -3.38249
H  -1.401587 0.330636 1.122618
H  -2.370902 1.848544 2.674283
H  -3.345529 3.177901 2.04615
H  3.071219 1.895859 0.790012
H  1.911583 0.67205 4.821952
H  0.4191 -0.812195 1.03463
