program: Gaussian 09
title: 000134729
version: EM64L-G09RevD.01
frameworkgroup: C1[X(C14H19N)]
method: RPBEPBE
basis: SDD
operation: Freq
keyword: #pfreq=noraman
keyword: PBEPBE/SDD
title: #p freq=noraman PBEPBE/SDD
converged: YES YES NO NO
title: Mulliken charges:
elementType: N C C C C C C C C C C C C C C H H H H H H H H H H H H H H H H H H H
charge: -0.052006 -0.147295 -0.251106 -0.252248 -0.462420 -0.434707 0.274835 0.323648 -0.378051 -0.737218 -0.449626 -0.451204 -0.624081 -0.239905 -0.237020 0.231895 0.238144 0.219571 0.214764 0.200057 0.216269 0.186102 0.191315 0.207031 0.224544 0.219266 0.217351 0.234198 0.241418 0.222930 0.185874 0.222997 0.221975 0.222705
chargesum: 0.00000
title: Mulliken charges with hydrogens summed into heavy atoms:
elementType: N C C C C C C C C C C C C C C
charge: -0.052006 0.084600 -0.012962 -0.032677 -0.047599 -0.032336 0.274835 0.323648 0.020296 -0.076056 -0.215429 -0.209786 0.007720 -0.017930 -0.014316
polarizability: 1.66096919e+02 -7.58870114e+00 1.54646135e+02 -1.55311291e+01 -7.17728976e+00 1.21529146e+02
1716.lowfreq: -10.3929 -4.1953 0.0002 0.0003 0.0007 7.5793 58.6492 104.4464 121.5981
frequency: 58.6434 104.4123 121.5853 144.4037 163.1745 205.4658 222.8704 238.5141 264.8801 273.7333 337.2098 353.6073 384.7027 422.7434 430.0580 466.6664 512.9820 522.3837 542.0429 566.3386 639.7004 683.9458 716.2914 760.5030 764.6716 783.7329 803.4227 833.8385 878.0111 908.6582 928.4249 943.8225 948.8894 983.5201 995.3580 1011.0313 1021.9460 1034.2926 1045.4192 1053.9814 1071.9286 1087.2015 1095.7687 1116.0594 1135.6747 1147.1376 1151.5623 1169.4388 1174.8330 1197.3831 1208.0044 1231.5632 1240.8461 1269.0626 1277.6897 1296.4004 1302.0292 1308.1307 1314.7588 1336.2226 1353.6740 1363.2030 1374.1116 1383.9844 1389.3683 1429.7248 1444.1895 1455.5563 1460.5926 1463.4313 1467.9135 1470.8926 1476.5877 1480.3041 1482.2041 1593.8997 1614.5380 2824.8366 2835.6786 2856.8579 2936.7999 2973.2983 2975.2365 2988.9797 3008.1514 3015.9828 3023.4901 3032.9998 3045.3886 3070.9859 3072.9824 3074.8436 3113.0843 3119.0477 3134.2375 3155.3626
redmass: 3.7212 3.2063 2.7346 3.1222 2.7785 1.1179 2.2589 1.2154 2.1679 3.0703 2.9776 2.4988 2.2941 2.9045 3.8155 3.0549 3.8652 3.1773 3.5986 3.6044 3.4601 2.9822 4.1723 1.4203 2.6161 2.8439 2.7954 2.5229 1.3764 2.4556 2.4264 1.3987 1.9808 1.3177 1.9217 1.7044 2.2437 1.8203 1.9849 2.0209 2.2753 2.0346 1.6894 1.3089 2.0969 2.5085 1.6416 1.0754 1.6443 1.3809 1.6240 1.5242 1.7973 1.5887 1.5242 1.6610 1.4315 1.5299 1.7372 1.3901 1.3768 1.4367 1.4391 1.2650 4.4636 1.1741 2.3056 1.0927 1.0818 1.0622 2.1051 1.0853 1.1517 1.0969 1.0654 6.9359 6.9877 1.0703 1.0681 1.0586 1.0813 1.0450 1.0736 1.0622 1.0860 1.0725 1.0873 1.0890 1.1011 1.1001 1.0996 1.1010 1.0853 1.0892 1.0938 1.1001
irintensity: 0.1796 0.1257 0.3997 2.9132 0.9022 0.0847 0.3611 0.5174 1.3090 1.4920 2.0370 2.3191 3.9049 3.7628 1.0725 2.0717 0.9224 5.2880 0.7343 2.5829 0.5821 4.9327 2.3017 63.5461 2.1059 3.3408 13.7501 6.8155 0.1167 3.1058 2.3956 2.5402 1.6073 0.2324 12.8446 1.6994 6.2303 12.1068 3.2247 18.7383 5.0231 4.8896 3.2123 2.1899 29.3961 2.5130 1.4520 0.4324 1.5785 3.6961 0.7182 3.7350 3.4324 10.9272 2.1007 5.4713 3.3048 2.7697 3.3625 0.7219 2.5464 2.9837 5.5370 9.9757 4.1338 1.0907 4.3861 14.3356 5.8903 23.2861 14.9740 7.0973 14.5834 9.1735 10.0438 0.6520 1.3420 47.1167 56.6308 189.1064 21.4446 37.3044 30.5094 42.2529 28.1068 46.8288 60.3108 51.6049 51.4393 46.8063 32.5480 37.6770 7.0864 3.8556 34.9557 36.9487
temp: 298.150 k
press: 1.00000 atm
elementType: 7 6 6 6 6 6 6 6 6 6 6 6 6 6 6 1 1 1 1 1 1 1 1 1 1 1 1 1 1 1 1 1 1 1
symmnumber: 1
zpe: 778589.5 jmol-1
zpe.correction: 0.296549 hartree
zpe.thermalcorrener: 0.309780 hartree
zpe.thermalcorrenthalpy: 0.310724 hartree
zpe.thermalcorrgfe: 0.257712 hartree
zpe.sumelectzpe: -598.507314 hartree
zpe.sumelectthermal: -598.494083 hartree
zpe.sumelectthermalent: -598.493139 hartree
zpe.sumelectthermalfe: -598.546151 hartree
dipole: -0.0638 0.0266 -0.3444
dipole: 0.3512
quadrupole: -91.3536 -85.8536 -90.0739
quadrupole: 1.0923 -0.5374 -2.6733
quadrupole: -2.2599 3.2401 -0.9802 1.0923 -0.5374 -2.6733
hfenergy: -598.8038628 hartree
pointgroup: C01 [X(C14H19N1)]
dipole: -0.0223514 0.0100905 -0.1359909 debye
polarizability: 167.3150608|-6.9101651|154.1722051|-14.2325443|-7.7637779|120.7849346 unknown
InChI: InChI=1S/C14H19N/c1-10-11-5-3-4-6-12(11)13-7-8-15(2)9-14(10)13/h3-6,10,13-14H,7-9H2,1-2H3
charge 0 multiplicity 1
34 atoms
N  -2.875193 -0.144715 -0.369021
C  -0.889637 1.203052 0.401027
C  -0.417704 -0.027681 1.249905
C  0.438714 1.833245 -0.143875
C  -1.779516 0.761907 -0.78614
C  -1.521471 -1.083947 1.48028
C  0.845863 -0.467648 0.507297
C  1.345134 0.606915 -0.27573
C  -2.319844 -1.396903 0.202032
C  1.041488 2.89845 0.809136
C  1.536217 -1.694346 0.557285
C  2.538501 0.464074 -1.009364
C  -3.820548 -0.407283 -1.471889
C  2.733468 -1.844076 -0.187928
C  3.232452 -0.771839 -0.965528
H  -1.458986 1.91456 1.026522
H  -0.101231 0.343077 2.249504
H  0.266905 2.31133 -1.130184
H  -2.226183 1.660634 -1.253056
H  -1.133078 0.272048 -1.562851
H  -2.228993 -0.698238 2.238323
H  -1.081867 -2.016569 1.885384
H  -1.66608 -1.925597 -0.541087
H  -3.15944 -2.075389 0.444056
H  1.214961 2.478288 1.81715
H  2.012276 3.266496 0.429583
H  0.361223 3.764584 0.909073
H  1.158455 -2.529063 1.160088
H  2.926231 1.291489 -1.6162
H  -4.647941 -1.043664 -1.109431
H  -3.348377 -0.920435 -2.348893
H  -4.25135 0.546114 -1.82744
H  3.276727 -2.795903 -0.163371
H  4.157324 -0.90087 -1.539552
