program: Gaussian 09
title: 000134711
version: EM64L-G09RevD.01
frameworkgroup: C1[X(C15H15F3N2)]
method: RPBEPBE
basis: SDD
operation: Freq
keyword: #p
keyword: freq=noraman
keyword: PBEPBE/SDD
title: #p freq=noraman PBEPBE/SDD
converged: YES YES NO NO
title: Mulliken charges:
elementType: F F F N N C C C C C C C C C C C C C C C H H H H H H H H H H H H H H H
charge: -0.163938 -0.165515 -0.168650 -0.087071 -0.015467 -0.410439 -0.513073 -0.395897 0.315218 -0.384693 -0.324447 0.356782 -0.442401 -0.475572 -0.372017 0.286582 -0.222339 -0.375618 0.232765 -0.156577 0.196679 0.223854 0.221057 0.233170 0.229434 0.196266 0.216966 0.198645 0.232246 0.266718 0.255577 0.272184 0.234603 0.236736 0.268229
chargesum: 0.00000
title: Mulliken charges with hydrogens summed into heavy atoms:
elementType: F F F N N C C C C C C C C C C C C C C C
charge: -0.163938 -0.165515 -0.168650 -0.087071 -0.015467 0.010094 -0.058846 0.029803 0.315218 -0.167727 0.106444 0.356782 0.079895 -0.203388 -0.137414 0.286582 0.014398 -0.107389 0.232765 -0.156577
polarizability: 2.76749127e+02 3.89203210e+00 1.59161861e+02 1.94811898e+00 5.20628580e+00 1.03471374e+02
1716.lowfreq: -2.6286 -1.0776 -0.0007 -0.0004 -0.0003 9.5124 13.6925 24.0403 39.1653
frequency: 12.3938 23.9485 39.0474 46.3932 64.4629 81.7058 103.8231 126.0169 148.5291 165.7866 196.9556 230.6011 249.9735 273.7653 302.8078 308.0120 337.4194 347.4791 377.3434 393.1468 405.3791 430.7833 448.7106 467.0919 504.2429 524.7442 552.8388 567.2888 608.7751 625.7038 671.8342 697.0264 737.7190 765.9607 775.6547 801.7454 813.1201 827.1159 909.2198 926.1261 936.9173 946.8594 966.0125 974.2811 983.0283 986.6869 991.7292 994.0777 1012.0411 1037.3495 1049.1249 1056.9017 1063.2198 1082.6039 1111.2805 1138.1966 1165.1031 1193.6395 1196.8313 1212.3410 1226.8624 1245.0811 1261.8843 1287.0809 1294.8655 1309.7653 1315.0484 1318.5240 1335.0362 1365.4257 1370.6392 1386.4827 1395.6940 1426.5415 1448.3268 1452.6040 1461.4902 1469.1822 1485.8154 1487.5753 1594.2002 1614.7787 1667.4619 2198.8082 2795.2646 2861.4579 2874.9691 2976.7832 2980.9703 3004.9393 3031.3904 3038.4086 3043.7523 3068.7855 3123.5804 3139.1461 3157.7274 3163.3222 3178.0252
redmass: 15.2493 6.5455 3.2687 5.7390 3.3855 4.9122 4.9361 6.1558 3.8733 5.7521 3.6031 2.8145 2.7767 4.4927 6.4292 6.1784 3.1410 4.3351 3.4566 5.1759 2.9889 5.7765 4.1297 5.0367 3.7625 8.5013 4.4444 6.1553 11.6997 4.4076 6.7302 1.9901 4.0446 4.7983 1.2188 1.8845 1.7339 1.3743 1.6251 1.4658 3.6104 3.2433 2.8070 2.2897 5.4725 6.3211 1.5636 2.1480 6.0884 3.2416 2.0502 2.1897 2.5412 2.1014 1.7600 2.2184 1.7363 1.1077 1.1722 1.4401 1.5975 1.7971 1.2945 1.2261 1.9697 1.7435 1.4262 1.3949 1.3278 1.5264 2.0963 4.7996 1.5094 3.2947 1.0885 1.1040 1.0841 1.0860 1.1297 2.3700 5.8211 5.9497 6.8455 12.4212 1.0717 1.0709 1.0708 1.0602 1.0829 1.0588 1.0980 1.0918 1.0895 1.1007 1.0904 1.0867 1.0932 1.0914 1.0977
irintensity: 0.1441 1.1721 1.2662 5.4996 2.4226 0.8057 2.5557 1.3899 0.8832 1.3391 1.9262 3.3248 0.5503 0.6329 1.0295 0.7370 9.0069 3.3315 2.9726 2.4228 2.7605 0.6027 3.2639 6.6005 1.9391 1.0766 1.9075 0.7509 18.7311 0.3054 3.8210 23.1095 19.9703 16.2971 2.8533 46.3563 49.4357 4.7271 25.7845 15.8095 8.9539 8.4974 30.2407 8.0380 163.6918 38.5035 16.8174 9.0915 142.3137 3.4787 26.2228 25.6237 91.0780 2.1776 6.3207 67.9770 7.2987 1.7991 9.3020 4.1447 60.1817 81.7564 7.0144 0.7613 131.3033 93.1361 22.6450 8.8508 15.4321 31.7010 7.6524 10.5780 1.1199 25.8659 6.2238 3.4634 17.0673 1.3288 23.6412 6.3655 7.3587 14.2454 18.9599 19.8653 76.4859 41.0751 148.3087 23.4734 31.2996 8.4556 23.1079 18.6858 27.2556 18.7135 19.3707 4.0048 13.1973 1.4864 5.8546
temp: 298.150 k
press: 1.00000 atm
elementType: 9 9 9 7 7 6 6 6 6 6 6 6 6 6 6 6 6 6 6 6 1 1 1 1 1 1 1 1 1 1 1 1 1 1 1
symmnumber: 1
zpe: 704879.3 jmol-1
zpe.correction: 0.268474 hartree
zpe.thermalcorrener: 0.287145 hartree
zpe.thermalcorrenthalpy: 0.288089 hartree
zpe.thermalcorrgfe: 0.218373 hartree
zpe.sumelectzpe: -988.132649 hartree
zpe.sumelectthermal: -988.113978 hartree
zpe.sumelectthermalent: -988.113034 hartree
zpe.sumelectthermalfe: -988.182751 hartree
dipole: 0.7883 3.9892 -0.8425
dipole: 4.1527
quadrupole: -178.8567 -108.7378 -118.1004
quadrupole: 2.7582 -0.0519 2.7909
quadrupole: -43.6251 26.4939 17.1312 2.7582 -0.0519 2.7909
hfenergy: -988.4011237 hartree
pointgroup: C01[X(C15H15F3N2)]
dipole: 0.3204132 -1.5656114 0.3398514 debye
polarizability: 276.7769243|-3.1981054|159.1804633|-2.498065|4.8709396|103.4249744 unknown
InChI: InChI=1S/C15H15F3N2/c16-15(17,18)14-4-1-3-13(11-14)12-5-9-20(10-6-12)8-2-7-19/h1,3-5,11H,2,6,8-10H2
charge 0 multiplicity 1
35 atoms
F  5.809949 0.782319 0.061727
F  4.472913 1.686481 -1.52865
F  4.146652 2.215463 0.646234
N  -3.043345 0.252573 0.203261
N  -7.892953 0.88211 -0.386935
C  -2.147788 0.856634 1.219891
C  -0.694844 0.866644 0.711411
C  -2.708145 -1.166101 -0.052293
C  -0.263846 -0.516345 0.233794
C  -1.221138 -1.430617 -0.099214
C  -4.476252 0.469476 0.478204
C  1.192843 -0.813244 0.128795
C  -5.327053 0.303614 -0.814592
C  2.13355 0.245936 0.034193
C  1.698043 -2.146804 0.13075
C  3.517162 -0.021661 -0.073262
C  3.077183 -2.408203 0.022359
C  4.003379 -1.347085 -0.085606
C  4.468161 1.131949 -0.214295
C  -6.746238 0.619345 -0.587923
H  -2.193537 0.306741 2.193893
H  -2.484665 1.89215 1.407833
H  -0.030642 1.216015 1.525886
H  -0.608271 1.598017 -0.116606
H  -3.148536 -1.476527 -1.02129
H  -3.166721 -1.840566 0.723422
H  -0.942099 -2.427147 -0.464248
H  -4.873443 -0.218131 1.266451
H  -4.606238 1.502005 0.84853
H  -4.917219 0.972163 -1.594124
H  -5.257912 -0.730562 -1.200189
H  1.791771 1.285192 0.038675
H  1.005995 -2.987397 0.247054
H  3.43774 -3.441888 0.035468
H  5.076944 -1.541849 -0.159303
