program: Gaussian 09
title: 000134707
version: EM64L-G09RevD.01
frameworkgroup: C1[X(C15H24O3)]
method: RPBEPBE
basis: SDD
operation: Freq
keyword: #pfreq=noraman
keyword: PBEPBE/SDD
title: #p freq=noraman PBEPBE/SDD
converged: YES YES NO NO
title: Mulliken charges:
elementType: O O O C C C C C C C C C C C C C C C H H H H H H H H H H H H H H H H H H H H H H H H
charge: -0.475384 -0.427727 -0.263196 0.380715 -0.014514 -0.625950 -0.482743 -0.143492 -0.544144 0.264342 0.213575 -0.485166 -0.458924 -0.760675 -0.356037 -0.752873 -0.754006 0.051005 0.204975 0.215331 0.268339 0.213304 0.200566 0.211070 0.209934 0.264471 0.216319 0.211038 0.222622 0.235956 0.210460 0.236194 0.217503 0.260144 0.199171 0.212179 0.253186 0.251737 0.200389 0.211741 0.330643 0.377923
chargesum: 0.00000
title: Mulliken charges with hydrogens summed into heavy atoms:
elementType: O O O C C C C C C C C C C C C C C C
charge: -0.144742 -0.049804 -0.263196 0.380715 0.190461 -0.142280 -0.068873 0.067578 -0.069739 0.264342 0.213575 -0.057809 -0.000346 -0.096518 -0.095893 -0.088337 -0.090140 0.051005
polarizability: 1.94243412e+02 -8.70284644e+00 1.66692117e+02 -1.08431743e+01 4.60804127e+00 1.40849401e+02
1716.lowfreq: -4.0512 -0.0007 -0.0005 0.0004 11.7112 17.9556 42.6397 46.3201 56.9720
frequency: 42.5002 46.2978 56.9459 63.1161 122.1205 140.8938 172.4623 180.8869 190.2293 215.8657 229.2362 239.8084 249.6580 270.7098 272.3934 280.5113 305.9750 314.5002 334.6114 348.0808 370.2467 385.6014 416.3541 437.6255 462.3744 493.0729 521.0782 534.8265 556.8637 562.3352 605.5365 624.1157 654.7865 704.7404 730.5471 755.2028 781.0126 807.3376 833.1206 869.9461 873.7458 897.7905 912.1051 913.6305 928.5201 953.2201 964.1526 971.9210 978.8585 992.9822 1005.2054 1022.0389 1029.5746 1043.9966 1067.8066 1081.1493 1102.8666 1108.7586 1113.2881 1119.7366 1130.7070 1149.6911 1185.6089 1195.3758 1197.5836 1216.2082 1237.0546 1252.2177 1272.9769 1284.8323 1290.3482 1295.7106 1302.5883 1311.3867 1318.7245 1325.6281 1343.7681 1346.4082 1359.5793 1369.0035 1374.0611 1390.1527 1390.8925 1446.1414 1458.9847 1461.6915 1466.9073 1469.0302 1474.8411 1475.5607 1482.4721 1484.3110 1488.1885 1494.1144 1601.6709 1640.2000 2946.3356 2955.7106 2967.5940 2970.5423 2974.9533 2981.0602 2992.6163 3004.7429 3007.1508 3013.3051 3021.8870 3047.7397 3055.6255 3063.6361 3068.8274 3072.4414 3078.7935 3085.8631 3093.6488 3094.9508 3097.7434 3114.5704 3511.7575 3551.3576
redmass: 4.0356 5.5963 5.0090 3.5096 3.5323 2.4978 1.6507 2.6064 2.8204 1.1161 2.3299 2.4377 1.4403 1.1420 1.6687 2.4526 2.4408 4.2967 2.7098 3.2532 2.1608 2.8774 2.7612 3.2011 3.2936 3.0035 2.3570 2.8537 2.7000 2.9630 4.5109 1.5579 2.5244 2.6762 4.4441 3.5178 2.3629 1.9478 2.1368 2.3094 2.0103 1.6192 2.2008 1.5957 1.6485 2.1773 1.6790 1.6686 1.6421 1.8824 2.3563 1.9700 2.5530 1.9558 1.8545 2.1349 1.4964 1.6914 2.2721 2.0931 1.7008 1.7240 1.4506 1.9302 1.9094 1.9582 1.4782 1.4763 1.4983 1.3461 1.4377 2.0190 1.2624 1.3643 1.6183 1.5301 1.4643 1.6680 1.8022 1.7394 1.2222 1.2075 1.2129 1.0907 1.0577 1.0513 1.0780 1.0781 1.0670 1.0721 1.0709 1.0668 1.0860 1.0573 7.6988 7.3987 1.0827 1.0638 1.0810 1.0373 1.0376 1.0374 1.0738 1.0833 1.0618 1.0602 1.0630 1.1010 1.0984 1.0975 1.0982 1.0999 1.1024 1.0985 1.0990 1.1006 1.0982 1.0902 1.0638 1.0660
irintensity: 0.5373 0.2240 0.2345 1.9064 0.8223 2.1657 0.1137 0.8579 0.2287 2.8776 1.8961 0.8466 1.2218 102.3070 12.6753 4.3886 5.0523 3.5893 3.3893 3.2175 1.1047 1.6120 3.8929 3.3155 3.0593 2.4858 4.1228 18.9687 4.3886 15.9110 6.6052 84.0183 23.9220 4.6480 33.5162 15.0426 11.8028 2.6895 2.9067 9.4539 16.3350 7.5033 4.7247 2.0017 8.1926 58.0165 4.9555 3.0893 8.3857 17.4294 14.3488 39.7108 9.7662 12.8247 19.7851 7.2576 39.4949 72.1146 79.2006 59.7111 2.9586 4.7231 6.8772 9.1751 0.3170 18.7269 4.1933 1.6927 9.5557 3.5644 8.4282 36.9027 1.3776 5.0223 17.6243 44.7319 4.1166 4.6476 11.6394 4.2052 29.8102 23.5885 16.4001 26.7683 2.9557 2.8402 6.0494 2.3474 4.3249 15.1426 17.8155 13.2800 9.1983 4.5360 243.1394 49.6072 21.3810 25.4294 27.3493 14.9741 50.4053 30.5649 29.7147 42.3055 38.9927 52.5464 32.8128 47.4251 1.5713 76.3434 33.7409 13.6438 10.7666 24.3452 14.4412 61.1417 21.2868 4.0547 33.0916 5.4608
temp: 298.150 k
press: 1.00000 atm
elementType: 8 8 8 6 6 6 6 6 6 6 6 6 6 6 6 6 6 6 1 1 1 1 1 1 1 1 1 1 1 1 1 1 1 1 1 1 1 1 1 1 1 1
symmnumber: 1
zpe: 951164.9 jmol-1
zpe.correction: 0.362280 hartree
zpe.thermalcorrener: 0.381145 hartree
zpe.thermalcorrenthalpy: 0.382089 hartree
zpe.thermalcorrgfe: 0.316571 hartree
zpe.sumelectzpe: -810.241368 hartree
zpe.sumelectthermal: -810.222503 hartree
zpe.sumelectthermalent: -810.221559 hartree
zpe.sumelectthermalfe: -810.287076 hartree
dipole: -2.5062 -2.8587 -0.2770
dipole: 3.8118
quadrupole: -103.9328 -109.9203 -108.7702
quadrupole: -10.0305 1.4946 2.1657
quadrupole: 3.6083 -2.3792 -1.2291 -10.0305 1.4946 2.1657
hfenergy: -810.6036475 hartree
pointgroup: C01 [X(C15H24O3)]
dipole: 0.9590596 1.1486493 -0.0991117 debye
polarizability: 193.9034195|-7.5767037|166.0709524|12.8539806|-5.0408589|141.8105582 unknown
InChI: InChI=1S/C15H24O3/c1-10-5-4-6-12(13(16)17)15(10)8-7-11(9-15)14(2,3)18/h6,10-11,16,18H,4-5,7-9H2,1-3H3
charge 0 multiplicity 1
42 atoms
O  3.1358 -1.153825 -0.64225
O  -0.354817 -2.595948 0.330498
O  -2.507916 -3.030403 -0.376727
C  -0.716164 0.291503 0.338151
C  1.76479 0.565643 0.378639
C  0.571013 0.306314 -0.574338
C  -0.139244 -0.090129 1.76513
C  -1.367706 1.731561 0.390258
C  1.387515 -0.306199 1.603308
C  3.163073 0.280184 -0.23462
C  -1.75943 -0.690855 -0.224399
C  -2.020363 2.096247 -0.969888
C  -3.184411 1.135223 -1.294764
C  -2.413815 1.903988 1.524126
C  -2.85297 -0.292894 -0.949659
C  4.283323 0.483929 0.811663
C  3.419981 1.152271 -1.486007
C  -1.623923 -2.176771 -0.10153
H  1.767176 1.635904 0.681526
H  0.483986 1.054679 -1.381623
H  0.720062 -0.682797 -1.041204
H  -0.632375 -0.976141 2.197431
H  -0.3140 0.7481 2.46249
H  -0.53907 2.446883 0.577587
H  1.938024 -0.026997 2.520372
H  1.608575 -1.358974 1.361532
H  -1.269301 2.040785 -1.779892
H  -2.385038 3.140993 -0.944234
H  -3.459702 1.198047 -2.366996
H  -4.103222 1.429115 -0.743087
H  -2.920553 2.882888 1.427775
H  -3.18556 1.114494 1.484409
H  -1.95777 1.869053 2.527882
H  -3.532477 -1.076649 -1.312313
H  5.279875 0.314451 0.358892
H  4.269533 1.512439 1.218096
H  4.15904 -0.224166 1.647929
H  2.692915 0.909785 -2.279091
H  4.438131 0.97687 -1.885154
H  3.333855 2.228884 -1.247689
H  4.018766 -1.3807 -1.031481
H  -0.342605 -3.591484 0.335651
