program: Gaussian 09
title: 000134685
version: EM64L-G09RevD.01
frameworkgroup: C1[X(C10H14O6)]
method: RPBEPBE
basis: SDD
operation: Freq
keyword: #pfreq=noraman
keyword: PBEPBE/SDD
title: #p freq=noraman PBEPBE/SDD
converged: YES YES NO NO
title: Mulliken charges:
elementType: O O O O O O C C C C C C C C C C H H H H H H H H H H H H H H
charge: -0.248603 -0.248620 -0.143926 -0.143887 -0.130194 -0.130192 -0.269405 -0.269417 -0.065062 -0.065017 -0.695576 -0.695577 0.162931 0.162889 -0.133197 -0.133190 0.172377 0.253935 0.172376 0.253880 0.201481 0.201437 0.207187 0.255584 0.255248 0.207194 0.255583 0.255250 0.177256 0.177256
chargesum: 0.00000
title: Mulliken charges with hydrogens summed into heavy atoms:
elementType: O O O O O O C C C C C C C C C C
charge: -0.248603 -0.248620 -0.143926 -0.143887 -0.130194 -0.130192 0.156907 0.156840 0.136419 0.136420 0.022443 0.022449 0.162931 0.162889 0.044059 0.044066
polarizability: 1.78306977e+02 -3.85549738e+00 1.25650924e+02 2.96518447e-03 8.49340156e-04 9.05111337e+01
1716.lowfreq: -10.0205 -0.0011 -0.0008 -0.0003 2.0788 4.4620 13.2826 19.8769 35.7596
frequency: 13.2819 19.8356 35.7478 40.3851 47.0032 101.6398 101.9300 108.0765 134.0081 157.5024 161.9952 189.5788 192.5989 201.3863 206.1081 243.4270 261.4444 272.8219 290.9323 312.4558 356.5504 389.2220 426.7248 463.5195 550.3426 569.2807 575.1584 670.2811 670.4504 792.6946 806.3249 826.2230 826.4100 902.0834 902.8319 927.5035 954.4818 982.1125 983.6561 1018.5992 1024.2980 1041.4724 1058.6427 1088.8017 1093.0777 1104.4173 1151.3924 1154.5468 1203.6421 1248.1605 1248.6665 1261.5126 1303.6279 1307.9787 1366.8040 1375.0753 1375.9389 1388.4306 1390.8072 1395.9199 1456.1592 1456.1688 1457.2816 1464.1562 1476.7670 1476.8730 1605.2740 1605.3746 1648.5567 1648.5858 2855.3249 2855.6502 2876.4569 2876.5605 2927.5493 2946.9241 3001.8179 3001.8917 3038.8838 3054.6068 3102.4425 3102.5266 3116.7847 3116.7937
redmass: 7.1185 6.6978 6.7372 10.3979 5.0949 7.6756 3.1392 3.0104 3.1562 4.7784 3.2362 1.1822 1.2271 3.5024 3.5330 2.0300 2.9607 3.4271 8.5658 10.9111 6.2140 3.5879 3.4143 4.8852 3.1867 3.4981 3.3857 3.7607 3.7500 2.4296 2.8519 4.4592 4.4163 1.6628 1.6327 2.5595 2.5253 2.6370 2.9603 2.6020 2.0273 2.2459 2.0658 3.9179 3.5542 2.3704 2.1370 2.3798 1.1415 1.3414 1.4005 1.1569 1.2801 1.2944 1.2604 1.2211 1.2306 1.2531 1.1886 1.3995 1.0479 1.0531 1.0773 1.0827 1.0512 1.0512 11.5152 11.4623 8.9835 8.9578 1.0793 1.0794 1.0857 1.0857 1.0635 1.0675 1.0350 1.0350 1.0953 1.0958 1.0994 1.0994 1.1015 1.1015
irintensity: 4.5248 3.3572 0.8260 0.2300 7.9631 2.5032 2.7464 16.0426 7.2320 2.4459 3.1603 1.1788 0.6022 5.5724 4.3719 2.6569 5.0542 0.2630 3.2265 0.0571 6.8973 1.0468 0.9211 0.2540 4.6508 0.0460 8.9035 0.1058 23.1768 12.6168 11.8069 0.0102 50.0519 2.9362 13.5446 6.9311 63.5818 112.2379 0.2698 22.4564 4.4004 129.2546 6.9282 28.6299 62.4292 0.0047 44.7329 10.5109 40.6973 0.1552 2.3801 1.3349 41.5258 2.8213 12.5845 3.9924 0.9075 15.3150 11.6303 4.3703 16.6655 7.7321 0.0987 25.7541 20.1965 2.0251 259.4301 0.4532 56.1771 0.3691 26.0047 28.3458 219.9356 27.1104 2.0838 120.5288 25.2122 6.9830 0.9552 30.4491 41.0086 2.4230 11.0700 8.3929
temp: 298.150 k
press: 1.00000 atm
elementType: 8 8 8 8 8 8 6 6 6 6 6 6 6 6 6 6 1 1 1 1 1 1 1 1 1 1 1 1 1 1
symmnumber: 1
zpe: 594778.7 jmol-1
zpe.correction: 0.226539 hartree
zpe.thermalcorrener: 0.245369 hartree
zpe.thermalcorrenthalpy: 0.246314 hartree
zpe.thermalcorrgfe: 0.175735 hartree
zpe.sumelectzpe: -839.443186 hartree
zpe.sumelectthermal: -839.424356 hartree
zpe.sumelectthermalent: -839.423412 hartree
zpe.sumelectthermalfe: -839.493991 hartree
dipole: 0.0013 -0.0004 -2.8730
dipole: 2.8730
quadrupole: -116.3287 -98.8518 -86.6767
quadrupole: 38.6804 0.0000 -0.0002
quadrupole: -15.7097 1.7673 13.9424 38.6804 0.0000 -0.0002
hfenergy: -839.6697256 hartree
pointgroup: C01 [X(C10H14O6)]
dipole: 0.0006316 -0.0004389 1.1303137 debye
polarizability: 178.5196897|1.90235|125.4381991|-0.0102059|0.0189818|90.5111453 unknown
InChI: InChI=1S/C10H14O6/c1-7(9(13)5-11)15-3-4-16-8(2)10(14)6-12/h5-8H,3-4H2,1-2H3
charge 0 multiplicity 1
30 atoms
O  1.270016 -0.781502 -0.058138
O  -1.270999 0.781452 -0.057274
O  3.224046 1.321818 -0.231727
O  -3.225591 -1.321468 -0.23266
O  6.006418 0.690254 0.186168
O  -6.007678 -0.689783 0.186775
C  0.758556 0.050258 1.047437
C  -0.759127 -0.050891 1.047687
C  2.686626 -1.084091 0.002894
C  -2.687583 1.084101 0.004326
C  2.981306 -1.998543 -1.207158
C  -2.982409 1.999708 -1.204819
C  3.60836 0.14745 -0.022616
C  -3.609562 -0.147254 -0.022059
C  5.102282 -0.167984 0.256455
C  -5.103339 0.168182 0.257793
H  1.147674 -0.335325 2.017209
H  1.078143 1.100139 0.912537
H  -1.147873 0.334199 2.017804
H  -1.078762 -1.100696 0.912375
H  2.920592 -1.638772 0.948357
H  -2.921244 1.637984 0.950333
H  4.027934 -2.350903 -1.217328
H  2.313729 -2.874391 -1.158264
H  2.775173 -1.454826 -2.143824
H  -4.02899 2.352221 -1.214442
H  -2.314706 2.875423 -1.155266
H  -2.776548 1.456829 -2.142029
H  5.324667 -1.230194 0.533786
H  -5.325412 1.230104 0.536469
