program: Gaussian 09
title: 000134675
version: EM64L-G09RevD.01
frameworkgroup: C1[X(C23H29NO2)]
method: RPBEPBE
basis: SDD
operation: Freq
keyword: #p
keyword: freq=noraman
keyword: PBEPBE/SDD
title: #p freq=noraman PBEPBE/SDD
converged: NO YES NO NO
title: Mulliken charges:
elementType: O O N C C C C C C C C C C C C C C C C C C C C C C C H H H H H H H H H H H H H H H H H H H H H H H H H H H H H
charge: -0.323437 -0.236190 -0.066510 -0.039225 -0.570836 -0.425606 0.115347 -0.428720 -0.448169 -0.383352 -0.665450 0.409655 0.329068 -0.360103 -0.369966 -0.379629 -0.410566 0.303808 -0.240923 -0.241480 -0.249089 -0.225692 -0.495650 -0.242561 -0.247887 -0.662369 0.235899 0.268947 0.225219 0.200718 0.218684 0.193388 0.210109 0.208410 0.213765 0.206932 0.194362 0.194376 0.242137 0.220085 0.253904 0.244238 0.250943 0.267405 0.224617 0.225989 0.224293 0.224579 0.242557 0.234688 0.227569 0.227150 0.239488 0.214099 0.220988
chargesum: 0.00000
title: Mulliken charges with hydrogens summed into heavy atoms:
elementType: O O N C C C C C C C C C C C C C C C C C C C C C C C
charge: -0.323437 -0.236190 -0.066510 0.196674 -0.076670 -0.006204 0.115347 -0.025223 -0.025995 0.017941 -0.008852 0.409655 0.329068 -0.106199 -0.125728 -0.128686 -0.143160 0.303808 -0.016306 -0.015492 -0.024796 -0.001114 -0.018406 -0.014992 -0.020737 0.012205
polarizability: 2.56986284e+02 -4.46525175e+00 2.44890616e+02 1.93788348e+01 -1.40193130e+01 2.44834322e+02
1716.lowfreq: -17.3200 -14.6655 -8.2167 -0.0006 0.0004 0.0006 6.4398 10.8111 30.6499
frequency: -16.9816 -3.6996 30.1981 37.5760 43.4382 46.1000 54.0847 67.4847 75.9942 85.0273 119.1788 157.2908 171.2171 183.0334 196.2423 204.8930 208.9969 227.5306 249.5318 261.1446 277.9817 289.0301 294.7751 311.0911 316.3228 349.8669 399.9572 401.9964 421.7737 427.1750 456.7504 485.0890 493.0659 518.5089 545.0939 548.3526 588.2806 598.7005 616.4761 616.9934 636.4024 658.8699 702.9676 704.8693 711.8199 754.2298 762.4551 769.1115 792.2415 794.2097 817.2352 820.2439 840.6380 853.7269 857.9081 861.2330 896.9386 902.7681 932.2435 934.2012 951.3650 977.0980 982.1439 982.8484 990.2254 992.3329 997.3810 997.5557 1003.1704 1012.2597 1016.7118 1023.5533 1030.6173 1044.8277 1071.9808 1077.4955 1080.1873 1080.9287 1087.2986 1096.2701 1114.8777 1117.8258 1124.4587 1129.9257 1157.9404 1171.9874 1173.5073 1176.2058 1189.5081 1192.0762 1197.5201 1205.1626 1233.6293 1241.6488 1248.7280 1271.5508 1283.8200 1309.1615 1315.4921 1325.9195 1327.1534 1328.7198 1330.5993 1336.8408 1342.8993 1350.5457 1370.3174 1378.9108 1382.4409 1395.7563 1431.6875 1433.3841 1436.2310 1442.4854 1455.6018 1458.4889 1460.1168 1467.4972 1469.9664 1471.2054 1480.3586 1481.9098 1482.9810 1485.4521 1495.8735 1589.5285 1592.9107 1610.6983 1613.2345 1641.8186 2885.7923 2959.8877 2962.9889 2966.4152 2974.9834 2979.0518 2989.9175 2995.2136 2997.9783 3022.2062 3024.0105 3030.3587 3041.8470 3046.8969 3050.0808 3072.8312 3079.6951 3093.0419 3105.1559 3121.5087 3122.9784 3128.7274 3131.9765 3142.1834 3144.5471 3158.7179 3159.2051 3173.2195 3176.0802
redmass: 1.9642 3.1048 3.7366 3.3850 3.5956 4.2672 4.4144 4.3914 7.9303 3.9714 3.2861 3.3511 2.0703 1.5570 3.9558 3.0318 2.6600 1.5942 4.1586 5.6462 2.1585 4.3556 2.0891 4.1869 5.0601 2.2822 2.8278 2.8456 2.1683 3.0973 3.5196 3.1353 3.0080 3.0102 2.8120 2.2288 3.1568 3.7511 6.3073 6.3917 4.9912 4.3867 1.9340 2.0060 2.6947 2.9125 2.3886 2.2324 1.3788 2.3222 2.2144 2.0177 2.7736 1.2594 1.6158 1.7627 2.4825 2.4118 1.5223 1.5625 2.0598 1.6631 1.4990 1.4018 5.7184 5.1096 1.3483 1.3590 2.0937 1.8730 2.0017 3.0015 2.1380 2.5729 2.4556 1.8744 1.9571 1.8968 1.7688 1.7999 2.1791 1.4729 1.9750 2.4066 1.4718 1.0534 1.0730 2.0778 1.4052 1.6757 1.1784 2.4963 2.1343 1.1967 1.2804 1.5241 1.3256 1.2818 1.3336 1.3430 1.4695 1.3320 1.7426 1.4080 1.3050 1.4347 1.5395 6.4074 6.6172 1.2106 1.1413 2.2155 2.2234 1.0868 1.0941 1.0793 1.0862 1.0986 1.0436 1.1017 2.1789 1.0596 1.0941 1.9797 1.0526 6.2011 6.1048 6.0456 6.0556 9.4499 1.0544 1.0633 1.0653 1.0725 1.0625 1.0710 1.0621 1.0625 1.0370 1.0759 1.0956 1.0989 1.1023 1.0965 1.0996 1.0992 1.0979 1.1005 1.1001 1.0849 1.0846 1.0883 1.0883 1.0940 1.0938 1.0978 1.0986 1.0968 1.0955
irintensity: 0.2418 0.1585 0.0666 0.5718 0.2209 1.0113 0.7708 0.1922 2.6252 0.5352 0.1535 1.0092 0.4091 0.7697 0.3521 0.3374 0.1259 0.3018 0.5287 2.2768 0.2527 6.4592 2.9831 5.8896 6.5724 4.1099 0.0708 0.1479 0.4747 4.7720 2.4008 2.6032 2.0149 3.4939 2.9434 7.0761 7.0123 10.1268 0.7678 0.2234 23.7810 5.3278 46.0746 41.6275 37.8426 22.2756 52.2535 24.7417 19.8482 5.0408 2.9193 5.9851 1.2704 0.6438 3.1965 4.2836 29.7768 19.6711 2.3086 1.9563 7.9521 22.9570 12.9763 2.3036 0.8799 0.9524 0.1765 1.9096 6.5842 33.2452 71.6647 6.3322 9.7192 18.3013 113.2797 10.8655 4.3763 2.8120 5.2808 30.7697 18.6971 16.3458 120.3604 110.3585 20.8961 0.0837 0.1296 5.4197 5.4756 12.9350 5.8098 20.7182 4.9580 1.8069 7.1044 9.0899 9.2887 14.8653 2.6376 2.9963 3.0064 7.5247 50.2111 9.5924 6.7727 3.3056 8.3255 2.7764 1.2296 21.2923 9.2602 11.2148 11.7713 26.9594 9.9911 22.3782 13.9465 5.2649 16.6012 1.0842 18.3619 10.5600 15.7916 10.5135 5.6116 3.0996 0.2925 5.9885 4.0850 118.1173 84.9337 31.3963 37.6808 6.4501 39.9707 42.0156 18.3360 15.3104 26.2992 61.6195 42.7705 71.6473 41.3985 7.1841 55.7789 36.1814 18.7351 33.9632 25.3731 2.4612 0.8297 4.0566 4.5477 26.2371 29.2464 36.5436 31.6458 9.4973 7.8650
temp: 298.150 k
press: 1.00000 atm
elementType: 8 8 7 6 6 6 6 6 6 6 6 6 6 6 6 6 6 6 6 6 6 6 6 6 6 6 1 1 1 1 1 1 1 1 1 1 1 1 1 1 1 1 1 1 1 1 1 1 1 1 1 1 1 1 1
symmnumber: 1
zpe: 1222229.8 jmol-1
zpe.correction: 0.465523 hartree
zpe.thermalcorrener: 0.489080 hartree
zpe.thermalcorrenthalpy: 0.490024 hartree
zpe.thermalcorrgfe: 0.412224 hartree
zpe.sumelectzpe: -1097.099625 hartree
zpe.sumelectthermal: -1097.076068 hartree
zpe.sumelectthermalent: -1097.075124 hartree
zpe.sumelectthermalfe: -1097.152924 hartree
dipole: -0.2912 0.4597 -1.4371
dipole: 1.5366
quadrupole: -147.4261 -154.8776 -145.3391
quadrupole: 2.6930 1.2871 1.3132
quadrupole: 1.7881 -5.6633 3.8752 2.6930 1.2871 1.3132
hfenergy: -1097.565148 hartree
pointgroup: C01 [X(C23H29N1O2)]
dipole: 0.1096351 0.2680084 0.5306962 debye
polarizability: 256.8365494|8.516093|250.3678918|16.261703|15.0784752|239.5067805 unknown
InChI: InChI=1S/C23H29NO2/c1-3-22(25)26-23(19-12-6-4-7-13-19,20-14-8-5-9-15-20)18-21-16-10-11-17-24(21)2/h4-9,12-15,21H,3,10-11,16-18H2,1-2H3
charge 0 multiplicity 1
55 atoms
O  -0.393148 -0.783787 1.292602
O  -0.533463 -2.898673 0.280382
N  2.882592 0.137017 -1.850918
C  2.025909 0.088123 -0.616554
C  0.595587 -0.352544 -1.006894
C  2.687288 -0.748589 0.518555
C  -0.55082 -0.007043 -0.012475
C  4.098504 -0.196656 0.848154
C  4.2195 0.704234 -1.523066
C  4.977171 -0.086694 -0.421134
C  2.96589 -1.122021 -2.626462
C  -1.958706 -0.332895 -0.56051
C  -0.468931 1.471264 0.416609
C  -3.082062 0.040201 0.223759
C  -0.793093 2.468785 -0.538595
C  -2.180558 -0.992474 -1.792414
C  -0.042072 1.871937 1.705235
C  -0.458722 -2.180467 1.301248
C  -4.393552 -0.242305 -0.209432
C  -0.686972 3.837505 -0.214649
C  -3.494437 -1.26693 -2.234828
C  0.058033 3.244525 2.032458
C  -0.440548 -2.681099 2.740604
C  -4.605906 -0.895696 -1.446389
C  -0.260119 4.233222 1.075175
C  -0.130623 -4.185729 2.84258
H  1.976505 1.139502 -0.264108
H  0.562005 -1.436392 -1.207125
H  0.36413 0.176456 -1.952225
H  2.754899 -1.811417 0.207327
H  2.052229 -0.716974 1.422171
H  3.989315 0.813467 1.296982
H  4.591728 -0.831911 1.609096
H  4.816823 0.751183 -2.453467
H  4.065423 1.746676 -1.176368
H  5.228896 -1.099866 -0.793608
H  5.935161 0.418537 -0.188034
H  3.371315 -2.001137 -2.069544
H  1.968505 -1.399784 -3.00797
H  3.61828 -0.950061 -3.502047
H  -2.92001 0.559084 1.175389
H  -1.140591 2.173002 -1.535328
H  -1.33644 -1.312442 -2.408636
H  0.199896 1.108576 2.448774
H  -5.248181 0.0522 0.410131
H  -0.941418 4.594042 -0.96543
H  -3.64788 -1.779878 -3.190948
H  0.385385 3.538606 3.036359
H  -1.436125 -2.458391 3.174525
H  0.282446 -2.074223 3.316158
H  -5.623903 -1.112177 -1.789494
H  -0.181404 5.296252 1.329176
H  -0.839424 -4.772124 2.234257
H  -0.2009 -4.522417 3.891912
H  0.885794 -4.408299 2.473433
