program: Gaussian 09
title: 000134658
version: EM64L-G09RevD.01
frameworkgroup: C1[X(C14H13NO2)]
method: RPBEPBE
basis: SDD
operation: Freq
keyword: #p
keyword: freq=noraman
keyword: PBEPBE/SDD
title: #p freq=noraman PBEPBE/SDD
converged: YES YES NO NO
title: Mulliken charges:
elementType: O O N C C C C C C C C C C C C C C H H H H H H H H H H H H H
charge: -0.347215 -0.264547 -0.361744 0.115866 0.434470 0.261795 -0.458269 -0.363774 -0.420522 -0.350003 -0.225332 -0.235770 -0.240160 0.294435 -0.459655 -0.016662 -0.539541 0.237384 0.252197 0.237961 0.304095 0.227652 0.226347 0.227245 0.228766 0.250480 0.323248 0.215483 0.218888 0.226883
chargesum: 0.00000
title: Mulliken charges with hydrogens summed into heavy atoms:
elementType: O O N C C C C C C C C C C C C C C
charge: -0.347215 -0.264547 -0.038496 0.115866 0.434470 0.261795 -0.220885 -0.111578 -0.182561 -0.045909 0.002320 -0.009423 -0.012915 0.294435 0.019591 0.198821 -0.093770
polarizability: 2.31572075e+02 1.61055354e+01 1.93328272e+02 -3.07905094e+00 4.38839251e+00 8.23530435e+01
1716.lowfreq: -13.2441 -8.2253 -6.1905 -2.5647 -0.0007 -0.0007 -0.0006 25.5814 36.3826
frequency: -9.9236 25.5463 36.3331 57.1961 90.1446 110.2595 147.8948 175.5246 216.0257 261.0565 267.4599 316.4499 354.4126 417.2337 417.8413 418.7048 469.1454 508.0651 509.9054 539.9713 568.1421 600.0212 636.2901 653.3533 672.5223 688.2920 727.7528 748.3977 783.5370 785.3549 815.1136 822.2229 882.5907 891.0844 913.9148 922.6925 958.9591 966.8740 969.8276 984.8969 994.1771 998.6368 1016.1563 1030.3320 1067.3064 1102.5256 1144.0114 1146.8210 1169.0553 1174.8021 1187.7389 1223.9326 1236.8938 1261.8711 1264.1904 1289.9646 1343.6539 1373.9577 1403.1817 1422.2666 1429.2466 1439.1270 1447.4567 1451.0501 1478.4336 1514.4720 1580.6783 1597.2640 1636.1204 1660.3558 1684.3219 2997.9863 3077.8537 3090.1183 3104.7352 3122.0679 3129.2097 3135.6228 3154.3066 3156.0053 3175.8127 3202.0624 3206.8171 3574.6856
redmass: 4.4296 4.6186 6.3525 3.6206 2.8931 3.5339 4.9154 4.1339 5.1155 5.1114 5.2516 4.4273 2.2181 3.5219 3.0440 2.7156 3.3408 7.3638 5.8920 1.1613 3.3101 4.2068 3.4927 2.3327 5.8912 8.9234 5.3523 1.3180 5.2855 2.0054 1.5216 4.0134 1.6479 4.0802 1.7615 1.3811 1.4459 1.3697 1.8117 1.3434 1.3342 1.2271 3.8145 2.5670 2.5445 3.2674 1.7475 1.7305 1.2956 1.6725 1.3624 1.9814 2.0289 1.3832 1.4781 1.2378 1.2221 2.1766 3.3436 4.7784 1.1760 2.5141 1.2696 2.0190 1.7444 3.8738 7.3664 5.6921 7.0000 4.6941 9.6849 1.0645 1.0906 1.0702 1.0914 1.0861 1.0870 1.0901 1.0969 1.0965 1.0966 1.1151 1.0941 1.0775
irintensity: 1.5860 0.4514 5.8221 0.4917 0.9396 0.7097 0.6466 2.7956 0.3116 1.3497 1.7191 21.8202 1.9306 5.0938 3.6962 1.5738 0.1645 0.2161 0.9647 128.7340 8.3312 13.6787 0.4149 12.3812 6.0020 20.8933 8.9825 1.9101 0.9817 67.3934 91.1506 29.7436 7.0672 69.4804 9.2992 1.4367 39.7075 1.1245 67.3984 6.5902 0.1490 24.2138 73.9616 16.4134 28.6744 253.8368 105.9659 19.4028 185.6392 425.9508 2.2448 33.1752 15.9409 49.4774 12.4235 1.9629 1.3699 60.8039 37.4544 27.7320 9.0020 40.5392 47.0715 51.4331 330.8495 13.8388 33.6354 11.3494 0.2121 8.3575 196.3538 42.8735 1.4017 14.6708 11.8633 0.8824 2.3867 15.4583 32.5964 32.7067 17.2539 23.1836 4.8779 29.8263
temp: 298.150 k
press: 1.00000 atm
elementType: 8 8 7 6 6 6 6 6 6 6 6 6 6 6 6 6 6 1 1 1 1 1 1 1 1 1 1 1 1 1
symmnumber: 1
zpe: 617442.3 jmol-1
zpe.correction: 0.235171 hartree
zpe.thermalcorrener: 0.249456 hartree
zpe.thermalcorrenthalpy: 0.250400 hartree
zpe.thermalcorrgfe: 0.192254 hartree
zpe.sumelectzpe: -745.282464 hartree
zpe.sumelectthermal: -745.268180 hartree
zpe.sumelectthermalent: -745.267236 hartree
zpe.sumelectthermalfe: -745.325382 hartree
dipole: 0.8125 -2.6670 -0.0214
dipole: 2.7881
quadrupole: -82.4969 -88.9744 -103.0411
quadrupole: -7.9666 -1.2730 1.6453
quadrupole: 9.0073 2.5297 -11.5370 -7.9666 -1.2730 1.6453
hfenergy: -745.5176359 hartree
pointgroup: C01 [X(C14H13N1O2)]
dipole: -0.4378119 0.8697657 -0.505068 debye
polarizability: 227.3921126|19.2826479|165.939212|-6.6362803|-51.5110212|113.9220662 unknown
InChI: InChI=1S/C14H13NO2/c1-2-10-15-14(16)17-13-9-5-7-11-6-3-4-8-12(11)13/h2-9,15H,1,10H2
charge 0 multiplicity 1
30 atoms
O  -0.709516 0.101671 -0.33033
O  -2.169621 -1.623018 0.462533
N  -2.913059 0.223974 -0.77799
C  1.652112 0.446711 -0.202692
C  2.974105 0.036049 0.224553
C  0.536729 -0.400347 0.138709
C  3.131704 -1.182967 0.963516
C  1.504156 1.665989 -0.941005
C  4.095233 0.867427 -0.10708
C  0.704162 -1.585653 0.860156
C  2.020199 -1.967361 1.269214
C  2.617771 2.452521 -1.247251
C  3.925253 2.051309 -0.827404
C  -1.965548 -0.54741 -0.14676
C  -4.34958 -0.106746 -0.702478
C  -5.066605 0.617527 0.426517
C  -5.695814 -0.009984 1.449534
H  4.135197 -1.486234 1.282977
H  0.503403 1.968381 -1.260112
H  5.094512 0.553843 0.217907
H  -0.157177 -2.206957 1.10584
H  2.140539 -2.898028 1.834046
H  2.492475 3.382724 -1.81238
H  4.790469 2.676674 -1.073536
H  -4.808167 0.149545 -1.677057
H  -4.432047 -1.197546 -0.56279
H  -2.602457 1.088094 -1.222578
H  -5.05581 1.717108 0.382526
H  -6.205718 0.550812 2.241037
H  -5.7095 -1.103712 1.528677
