program: Gaussian 09
title: 000134637
version: EM64L-G09RevD.01
frameworkgroup: C1[X(C14H17NO2)]
method: RPBEPBE
basis: SDD
operation: Freq
keyword: #p
keyword: freq=noraman
keyword: PBEPBE/SDD
title: #p freq=noraman PBEPBE/SDD
converged: NO YES NO NO
title: Mulliken charges:
elementType: O O N C C C C C C C C C C C C C C H H H H H H H H H H H H H H H H H
charge: -0.309687 -0.251065 -0.004709 -0.103766 -0.495996 -0.453318 -0.451294 -0.049621 -0.463333 -0.465383 0.215915 0.209518 -0.337111 -0.337727 -0.222277 -0.220146 -0.223359 0.211844 0.226172 0.221810 0.212571 0.209949 0.209818 0.213387 0.276983 0.223510 0.253289 0.239009 0.236263 0.269872 0.264994 0.232692 0.229707 0.231491
chargesum: 0.00000
title: Mulliken charges with hydrogens summed into heavy atoms:
elementType: O O N C C C C C C C C C C C C C C
charge: -0.309687 -0.251065 -0.004709 0.108078 -0.048013 -0.030798 -0.028089 0.227362 0.013466 0.009889 0.215915 0.209518 -0.067239 -0.072733 0.010415 0.009560 0.008132
polarizability: 2.15191989e+02 6.30976443e+00 1.55253053e+02 -6.29514759e+00 2.05444694e+00 1.02898732e+02
1716.lowfreq: -12.8531 -7.1986 -0.0006 0.0005 0.0008 7.6628 26.2064 32.3369 46.5015
frequency: 25.9793 31.6256 46.0263 68.9644 107.3599 161.8359 195.8916 213.2643 275.7660 298.1859 327.5801 367.0283 393.5821 403.7881 425.3502 447.6752 509.8312 537.6514 588.4274 594.9457 614.1398 660.6866 677.4160 701.3173 759.6229 772.8551 790.1144 795.3975 800.7218 812.8326 838.5538 864.2746 871.4178 909.1440 937.3695 953.8780 972.3961 981.9196 988.5535 991.2573 995.2857 1007.7636 1016.2822 1022.4015 1045.4690 1054.4701 1067.5241 1085.0855 1104.1499 1119.3980 1145.6299 1173.1591 1180.1105 1184.7464 1202.6525 1237.1708 1237.8079 1258.1221 1272.9252 1295.3632 1304.6216 1313.5635 1315.4161 1315.6637 1320.5367 1338.2585 1344.6972 1371.1275 1389.8078 1437.9413 1457.0876 1461.1258 1468.3378 1469.0708 1477.2828 1483.0233 1586.0520 1611.4101 1627.2485 2983.1287 2984.5672 2996.7960 3006.9879 3017.0789 3033.8814 3035.9449 3041.5695 3042.0738 3063.1523 3074.3424 3084.0396 3128.9551 3141.4169 3154.6398 3166.4354 3178.1634
redmass: 3.6321 4.2697 3.7579 6.8903 3.3286 5.0622 2.8539 3.4968 2.9829 2.7875 2.1833 3.0314 2.8660 2.8248 4.9176 4.0566 5.0906 4.3560 6.3203 3.8774 6.4402 6.6857 5.0376 1.6032 4.9506 1.6550 3.5505 2.2005 2.9244 1.4944 2.1426 1.2457 2.9897 2.9534 1.7582 1.4250 2.6364 3.9368 2.4941 6.1128 1.3858 1.3289 3.3009 2.8517 2.5679 2.8248 2.8103 1.6639 1.6093 1.5243 1.1360 1.0565 1.1328 1.3891 1.3822 1.3149 2.5558 1.4915 1.4822 1.3579 1.3177 1.3350 1.3922 1.4459 1.3443 1.4093 1.4289 1.2595 10.1992 2.2456 1.0848 1.0802 1.0822 1.0823 2.2962 1.0895 6.7480 6.1054 10.9703 1.0600 1.0593 1.0606 1.0610 1.0622 1.0886 1.0959 1.0974 1.1006 1.1023 1.1056 1.1052 1.0854 1.0892 1.0939 1.0978 1.0975
irintensity: 0.1924 0.8863 1.0042 0.5093 1.2094 0.1599 1.5117 1.2616 6.5732 3.0251 0.4408 3.5290 1.6794 0.0019 0.8365 1.3606 1.5238 6.0979 4.0637 5.2826 1.0594 3.9760 12.7905 83.5238 24.6273 6.9421 5.3247 20.5472 4.8350 12.3458 17.7340 0.1059 6.0134 14.2795 18.3595 3.6910 208.5180 104.1852 18.0889 7.2187 0.1626 0.3616 145.7463 3.5453 159.6803 35.8924 15.7863 20.7822 2.3705 0.4572 1.2804 0.1185 53.4792 8.4865 7.3940 52.6505 267.2761 12.4858 11.8147 26.7310 2.5649 0.9288 2.9590 5.7943 1.1954 0.5402 2.1859 0.5889 2.6740 15.6798 8.4193 0.3041 10.8765 22.9898 5.5372 8.0918 29.3812 11.9440 161.8204 44.4627 32.6359 29.1629 63.5856 59.3632 2.6073 20.5460 33.4625 34.4258 24.8311 49.8244 51.5426 0.1606 11.9668 16.9198 23.5986 8.8136
temp: 298.150 k
press: 1.00000 atm
elementType: 8 8 7 6 6 6 6 6 6 6 6 6 6 6 6 6 6 1 1 1 1 1 1 1 1 1 1 1 1 1 1 1 1 1
symmnumber: 1
zpe: 745546.2 jmol-1
zpe.correction: 0.283964 hartree
zpe.thermalcorrener: 0.298264 hartree
zpe.thermalcorrenthalpy: 0.299208 hartree
zpe.thermalcorrgfe: 0.240883 hartree
zpe.sumelectzpe: -747.620786 hartree
zpe.sumelectthermal: -747.606485 hartree
zpe.sumelectthermalent: -747.605541 hartree
zpe.sumelectthermalfe: -747.663866 hartree
dipole: -1.0686 2.6133 0.6149
dipole: 2.8895
quadrupole: -78.7532 -100.4762 -103.0777
quadrupole: 2.7614 -1.4486 -0.9198
quadrupole: 15.3492 -6.3738 -8.9753 2.7614 -1.4486 -0.9198
hfenergy: -747.9047492 hartree
pointgroup: C01 [X(C14H17N1O2)]
dipole: 0.3977544 -1.0640213 -0.0451516 debye
polarizability: 215.5591611|3.2767357|152.4671069|6.3689001|11.4067908|105.3175058 unknown
InChI: InChI=1S/C14H17NO2/c16-14(12-4-2-1-3-5-12)17-13-10-11-6-8-15(13)9-7-11/h1-5,11,13H,6-10H2
charge 0 multiplicity 1
34 atoms
O  0.076196 -0.136049 0.439796
O  -0.691426 2.051377 0.777426
N  2.047883 0.5838 -0.765917
C  3.621366 -0.984239 0.580765
C  2.27477 -0.779396 1.334923
C  3.312061 -1.614908 -0.804679
C  4.308091 0.394572 0.358153
C  1.482818 0.32517 0.579854
C  2.248885 -0.699167 -1.513654
C  3.368994 1.262184 -0.562147
C  -0.923331 0.850099 0.501532
C  -2.277933 0.282003 0.233682
C  -3.389527 1.163321 0.277572
C  -2.476617 -1.092635 -0.057154
C  -4.688725 0.674251 0.032358
C  -3.778918 -1.578253 -0.300138
C  -4.886022 -0.697593 -0.256424
H  4.281575 -1.64775 1.167351
H  1.696295 -1.721931 1.341075
H  2.442984 -0.482545 2.386062
H  2.923466 -2.643222 -0.680018
H  4.242035 -1.684677 -1.400948
H  5.29851 0.249841 -0.112393
H  4.476777 0.892157 1.332642
H  1.474214 1.28949 1.118645
H  2.558447 -0.439564 -2.541237
H  1.266971 -1.197232 -1.578758
H  3.183601 2.259594 -0.124781
H  3.816446 1.4145 -1.560177
H  -3.210519 2.219757 0.503513
H  -1.612324 -1.761606 -0.087141
H  -5.544959 1.356561 0.065402
H  -3.93272 -2.639704 -0.523258
H  -5.896163 -1.077708 -0.446526
