program: Gaussian 09
title: 000134627
version: EM64L-G09RevD.01
frameworkgroup: C1[X(C2H5NO2)]
method: RPBEPBE
basis: SDD
operation: Freq
keyword: #pfreq=noraman
keyword: PBEPBE/SDD
title: #p freq=noraman PBEPBE/SDD
converged: NO YES NO NO
title: Mulliken charges:
elementType: O O N C C H H H H H
charge: -0.414075 -0.240618 -0.537592 -0.457975 0.188758 0.256294 0.256205 0.284917 0.285087 0.378999
chargesum: 0.00000
title: Mulliken charges with hydrogens summed into heavy atoms:
elementType: O O N C C
charge: -0.035076 -0.240618 0.032412 0.054524 0.188758
polarizability: 4.10937327e+01 -2.30318348e+00 3.74937299e+01 -5.63334978e-03 6.37529983e-03 2.55085980e+01
1716.lowfreq: 0.0006 0.0007 0.0008 1.6944 10.1029 20.0186 60.9972 212.0581 236.7826
frequency: 60.6088 212.0299 236.7825 433.3221 486.4286 588.0641 632.9029 662.3309 815.0667 890.9436 1027.0594 1146.0776 1151.9384 1254.3181 1326.1797 1345.0040 1429.9805 1659.6522 1668.2646 3006.9353 3060.3856 3471.6760 3506.4757 3590.8939
redmass: 1.9712 1.1989 4.1069 4.6339 1.7082 3.1661 1.3432 1.7705 4.6215 1.4958 2.8923 3.5461 1.2881 1.6727 1.2027 1.5479 1.0938 1.1130 7.0194 1.0614 1.1007 1.0457 1.0642 1.0971
irintensity: 5.5578 53.7212 16.3226 46.3334 49.1519 12.2388 137.3831 301.4222 17.5958 5.7947 258.1044 2.4035 0.0287 11.1536 0.0004 12.4630 34.5975 11.9197 240.2932 18.1326 10.1424 1.7502 12.2661 4.1652
temp: 298.150 k
press: 1.00000 atm
elementType: 8 8 7 6 6 1 1 1 1 1
symmnumber: 1
zpe: 201351.4 jmol-1
zpe.correction: 0.076691 hartree
zpe.thermalcorrener: 0.082583 hartree
zpe.thermalcorrenthalpy: 0.083527 hartree
zpe.thermalcorrgfe: 0.047359 hartree
zpe.sumelectzpe: -283.998495 hartree
zpe.sumelectthermal: -283.992603 hartree
zpe.sumelectthermalent: -283.991659 hartree
zpe.sumelectthermalfe: -284.027827 hartree
dipole: 0.8273 -0.4123 -0.0054
dipole: 0.9244
quadrupole: -27.8577 -34.7032 -27.1921
quadrupole: -2.5378 0.0150 -0.0019
quadrupole: 2.0600 -4.7855 2.7256 -2.5378 0.0150 -0.0019
hfenergy: -284.0751859 hartree
pointgroup: C01 [X(C2H5N1O2)]
dipole: -0.3207583 0.1713992 -0.0018633 debye
dipolederiv: -1.0165805 0.546074 -0.0000315 0.4165607 -0.5865644 0.0005137 -0.0013631 0.0011654 -0.438269 -0.6143905 -0.1248211 -0.0008974 0.1270689 -1.0140525 -0.0010366 -0.0008217 -0.0023029 -0.3150359 -0.9169616 -0.0942997 -0.0006758 -0.0965874 -0.4523122 -0.0023147 -0.0014218 -0.0019911 -0.2070934 0.4864446 -0.134657 -0.001957 -0.3093324 0.1286598 0.0003107 -0.0031088 0.0001523 0.1893844 1.1982051 -0.1993328 0.0028971 -0.3362929 1.3604849 0.0018454 0.0037452 0.0021539 0.169551 0.029964 0.0198199 -0.0233294 0.0323572 0.0513367 0.0887336 -0.0307922 0.122449 -0.009215 0.0295803 0.0192041 0.0237403 0.0318861 0.0543357 -0.0877789 0.031851 -0.121531 -0.0128887 0.3115112 0.0358554 -0.0908756 0.1410205 0.142745 -0.1203648 -0.0427653 -0.0705954 0.1092516 0.3121084 0.0341564 0.0917132 0.1403256 0.1395636 0.1208233 0.0455875 0.0710792 0.1130362 0.1801191 -0.1019992 -0.0005839 -0.1470064 0.1758035 -0.0007318 -0.0009109 -0.0005794 0.4012788 unknown
polarizability: 40.9602184|-2.4015774|37.6271826|0.0090604|0.0253462|25.5086596 unknown
InChI: InChI=1S/C2H5NO2/c3-1-2(4)5/h4H,1,3H2
charge 0 multiplicity 1
10 atoms
O  -1.695579 0.729492 -0.004619
O  -0.673655 -1.361408 -0.006868
N  1.958073 -0.07583 -0.004385
C  0.726194 0.704769 0.001964
C  -0.574843 -0.115946 -0.003093
H  0.696824 1.381019 -0.872573
H  0.697451 1.367136 0.887238
H  2.095698 -0.631363 -0.853938
H  2.094579 -0.646544 0.835239
H  -2.527441 0.181675 -0.007466
