program: Gaussian 09
title: 000134609
version: EM64L-G09RevD.01
frameworkgroup: C1[X(C4H8N4O2)]
method: RPBEPBE
basis: SDD
operation: Freq
keyword: #pfreq=noraman
keyword: PBEPBE/SDD
title: #p freq=noraman PBEPBE/SDD
converged: YES YES NO NO
title: Mulliken charges:
elementType: O O N N N N C C C C H H H H H H H H
charge: -0.445271 -0.252214 -0.092046 -0.161074 -0.617768 -0.621416 0.058872 -0.747667 0.111792 0.288833 0.238900 0.238761 0.263091 0.343607 0.319263 0.309711 0.387534 0.377093
chargesum: 0.00000
title: Mulliken charges with hydrogens summed into heavy atoms:
elementType: O O N N N N C C C C
charge: -0.068178 -0.252214 -0.092046 -0.161074 0.045102 0.075829 0.058872 -0.006915 0.111792 0.288833
polarizability: 1.67457489e+02 -2.90361720e+00 8.49526965e+01 -4.39431613e-03 2.12177034e-02 3.99261072e+01
1716.lowfreq: -4.3354 -2.6765 0.0010 0.0010 0.0011 6.7359 54.6454 65.1562 77.6166
frequency: 54.6264 65.1288 77.6056 101.6735 124.3187 210.7669 264.6341 284.3984 311.1837 352.0652 444.8500 455.6098 486.2508 498.9261 541.6398 594.8891 598.8362 612.8726 674.6583 713.1029 786.2159 787.3500 936.5982 990.7131 1016.5580 1025.4141 1033.1562 1056.1508 1149.2844 1201.5795 1323.9632 1389.7622 1456.0830 1462.1435 1463.9539 1513.7817 1561.7689 1585.2373 1630.1648 1642.7750 2989.0929 3058.6491 3143.5930 3423.4610 3527.4088 3557.4971 3671.2093 3712.0229
redmass: 2.6219 1.3999 4.0656 5.1665 5.2990 1.2294 4.4773 3.5541 2.9309 4.1507 1.2389 2.7934 5.8785 4.1041 1.1496 1.2074 3.9820 4.7931 4.6060 5.9961 1.2304 3.8202 4.9913 2.4516 2.0624 1.6308 1.5023 2.0580 7.2941 1.8483 3.7877 1.2198 1.1078 1.0537 2.8749 1.8959 3.3716 2.0704 1.7029 7.2968 1.0389 1.0958 1.0977 1.0536 1.0639 1.0455 1.0949 1.1047
irintensity: 2.6628 2.3135 0.0006 4.9513 15.8265 0.9549 0.5491 3.3385 13.9038 4.9988 419.8467 9.9988 3.6390 10.3347 48.7243 118.4461 37.8642 18.7075 0.0920 45.9396 151.3181 0.7495 175.2163 13.4670 401.7637 31.5929 2.9791 220.8700 108.6750 36.8523 200.4502 35.4066 22.6317 21.7100 616.8375 158.8629 52.9467 293.4050 388.4421 254.6577 13.6437 17.4604 4.3766 50.7334 46.1343 106.3379 75.5955 50.0506
temp: 298.150 k
press: 1.00000 atm
elementType: 8 8 7 7 7 7 6 6 6 6 1 1 1 1 1 1 1 1
symmnumber: 1
zpe: 356269.6 jmol-1
zpe.correction: 0.135696 hartree
zpe.thermalcorrener: 0.146930 hartree
zpe.thermalcorrenthalpy: 0.147875 hartree
zpe.thermalcorrgfe: 0.098169 hartree
zpe.sumelectzpe: -525.895080 hartree
zpe.sumelectthermal: -525.883845 hartree
zpe.sumelectthermalent: -525.882901 hartree
zpe.sumelectthermalfe: -525.932607 hartree
dipole: 5.5693 0.3145 0.0025
dipole: 5.5782
quadrupole: -28.3077 -58.4715 -61.0752
quadrupole: -4.8833 0.0219 0.0030
quadrupole: 20.9771 -9.1867 -11.7904 -4.8833 0.0219 0.0030
hfenergy: -526.0307758 hartree
pointgroup: C01 [X(C4H8N4O2)]
dipole: -2.1888913 -0.0865277 -0.1326627 debye
dipolederiv: -1.460966 0.4487268 -0.0870759 0.4605727 -0.4301099 0.0289672 -0.0885631 0.0282584 -0.4429984 -0.7256372 -0.1413901 -0.0182901 -0.4841188 -1.0520507 0.0051882 -0.001777 0.0267256 -0.3302544 1.3659263 0.1170205 0.0888115 0.4607307 -0.4935412 0.0459099 0.0720063 0.0244466 -0.1388595 -2.2462338 0.1579123 -0.1326017 0.0601355 -0.3733137 0.0095761 -0.1270042 0.0157364 -0.2686624 -1.651424 -0.3399623 -0.0436678 -0.4843153 -0.4115219 -0.0447282 -0.0400569 -0.0359595 -0.7141718 -0.5091606 0.0812773 0.0048459 0.552412 -1.1477728 0.0593062 -0.0187748 0.029714 -0.6471517 -1.3049954 -0.165043 -0.0730353 -0.3102981 0.4079908 -0.0398932 -0.0645882 -0.0314675 -0.0188135 0.0819352 -0.050434 0.0020629 0.0688036 -0.2697645 0.0214171 -0.0066842 0.0148512 0.0830155 2.3385985 -0.0871902 0.1399505 0.6137586 1.1890449 -0.010597 0.1060376 -0.0546481 0.2098363 2.7249904 0.0638297 0.1524281 -0.8963162 1.3859634 -0.1119297 0.2003466 -0.0519122 0.2784592 0.0686427 -0.0544358 -0.0899903 0.0214899 0.029807 -0.0441242 -0.0370596 -0.0967567 -0.0357136 0.0534772 -0.0541918 0.1056504 0.0221931 0.0419408 0.0403774 0.0467144 0.0835364 -0.0342301 -0.0544196 0.0963373 -0.0139035 0.0428365 0.1166416 0.002794 -0.0109719 0.005739 0.1211251 0.2450958 0.0504494 -0.0112191 0.1018521 0.2143323 0.0149845 -0.0134478 0.0119987 0.386867 0.2551696 0.0311822 -0.0103229 -0.0008809 0.1536121 0.0116327 -0.0066458 0.0138116 0.4000194 0.161735 0.0057126 -0.0161705 0.0036077 0.2170898 0.0099212 -0.0161952 0.0101863 0.4101218 0.3040504 -0.0845305 0.0014812 -0.0863261 0.2928571 -0.0026747 0.0015271 -0.0025837 0.3468418 0.3532157 -0.0752704 0.0010467 -0.1461371 0.128795 0.0038725 0.0051366 0.0083236 0.3945693 unknown
polarizability: 166.8061622|-4.1434463|84.9659468|8.1967948|-2.4754929|40.5641836 unknown
InChI: InChI=1S/C4H8N4O2/c1-2(3(9)10)7-8-4(5)6/h9H,5-6H2,1H3
charge 0 multiplicity 1
18 atoms
O  3.330941 -0.202795 0.297288
O  2.116718 1.769581 0.122758
N  -0.22518 0.222801 0.051847
N  -1.355182 -0.595617 0.020927
N  -3.675119 -0.464883 -0.132448
N  -2.409757 1.553342 -0.152025
C  0.942813 -0.400463 0.154649
C  1.095191 -1.901857 0.236153
C  2.112911 0.514094 0.184384
C  -2.467196 0.188916 -0.0880
H  0.636875 -2.377556 -0.650893
H  0.542274 -2.291881 1.111105
H  2.152677 -2.18886 0.30736
H  -3.645252 -1.480815 -0.080564
H  -4.565328 0.0169 -0.209063
H  -3.217172 2.162746 -0.233712
H  -1.448798 1.917602 -0.1094
H  4.068484 0.464644 0.311134
