program: Gaussian 09
title: 000011409
version: EM64L-G09RevD.01
frameworkgroup: C1[X(C9H12O3)]
method: RPBEPBE
basis: SDD
operation: Freq
keyword: #pfreq=noraman
keyword: PBEPBE/SDD
title: #p freq=noraman PBEPBE/SDD
converged: YES YES NO NO
title: Mulliken charges:
elementType: O O O C C C C C C C C C H H H H H H H H H H H H
charge: -0.279303 -0.196092 -0.234917 -0.370502 -0.344278 -0.250301 -0.687605 0.206648 0.180588 -0.330843 -0.255048 -0.149507 0.207804 0.207527 0.197474 0.197842 0.225487 0.225221 0.211811 0.211768 0.219316 0.280503 0.259218 0.267188
chargesum: 0.00000
title: Mulliken charges with hydrogens summed into heavy atoms:
elementType: O O O C C C C C C C C C
charge: -0.279303 -0.196092 -0.234917 0.044829 0.051038 0.200406 -0.044710 0.206648 0.180588 -0.050339 0.004171 0.117681
polarizability: 1.56843649e+02 9.21090333e+00 1.06633685e+02 -7.09216714e-02 7.13747693e-02 6.26836989e+01
1716.lowfreq: -39.0319 -4.7047 -3.3126 -0.0010 -0.0006 0.0004 16.7478 44.1110 59.8766
frequency: -25.5957 43.3241 59.8547 73.4088 95.1318 128.8555 156.9774 212.4062 236.0568 236.3171 278.5279 394.6793 437.3957 502.7205 588.2896 594.2754 716.0130 737.6422 752.3650 762.3771 794.8004 840.2603 869.7658 880.2336 899.9739 900.5253 912.2509 929.8783 1006.7820 1040.2007 1049.2850 1068.6937 1085.1663 1124.0565 1146.0959 1147.4983 1210.5657 1211.4060 1258.1185 1269.9214 1273.9714 1285.8353 1344.0363 1367.2022 1371.6531 1390.3170 1456.1421 1467.2401 1470.8522 1478.3792 1480.3803 1489.2545 1541.1288 1647.0169 2969.0967 2975.6249 2989.6833 2999.2058 3012.5189 3042.6436 3068.3405 3076.3544 3076.8715 3227.1540 3248.1131 3269.2861
redmass: 2.2458 2.6426 4.3759 4.5353 2.3808 3.2153 4.0898 4.2041 4.9627 1.1759 5.4510 4.0616 4.0700 7.0554 4.4692 3.6923 6.8403 1.0723 1.2472 9.1056 1.1400 1.3272 6.7879 4.6340 1.3877 3.5561 2.4000 1.1636 1.6895 3.2596 2.9672 3.3448 2.2537 2.6264 1.8929 1.4870 1.5454 1.3432 3.6077 1.1599 1.5397 1.0817 1.4541 2.6184 1.5859 1.2183 4.9461 1.0815 1.0765 1.0422 1.0693 1.0902 6.2841 11.4852 1.0584 1.0366 1.0597 1.0565 1.1003 1.1037 1.1042 1.0996 1.1043 1.0917 1.0994 1.1087
irintensity: 1.3901 0.3401 1.2305 0.0353 0.1601 4.3182 0.6119 0.3996 7.9585 0.1974 0.6430 7.6363 2.6571 0.5679 14.0468 0.0188 14.1091 8.3508 91.0947 7.4692 0.6244 15.4429 7.4118 0.5218 1.3654 39.2975 5.1122 0.5590 80.8054 11.7601 11.8033 376.5179 18.1107 1.8826 55.0796 2.1299 5.5344 0.0042 143.4610 0.5139 44.9540 0.0996 0.5814 5.9291 9.5461 6.9103 85.6582 0.0260 1.2892 13.1944 3.7374 18.5074 36.3705 247.9513 27.5119 30.9031 13.8880 44.9769 6.2032 1.7279 0.6212 53.8803 124.1412 2.5953 0.3523 0.0890
temp: 298.150 k
press: 1.00000 atm
elementType: 8 8 8 6 6 6 6 6 6 6 6 6 1 1 1 1 1 1 1 1 1 1 1 1
symmnumber: 1
zpe: 506441.4 jmol-1
zpe.correction: 0.192893 hartree
zpe.thermalcorrener: 0.204609 hartree
zpe.thermalcorrenthalpy: 0.205553 hartree
zpe.thermalcorrgfe: 0.153635 hartree
zpe.sumelectzpe: -574.887754 hartree
zpe.sumelectthermal: -574.876038 hartree
zpe.sumelectthermalent: -574.875094 hartree
zpe.sumelectthermalfe: -574.927013 hartree
dipole: 0.5115 -3.2657 -0.0092
dipole: 3.3055
quadrupole: -53.3306 -75.9511 -72.0658
quadrupole: 8.1787 -0.0145 0.0065
quadrupole: 13.7852 -8.8353 -4.9500 8.1787 -0.0145 0.0065
hfenergy: -575.0806475 hartree
pointgroup: C01 [X(C9H12O3)]
dipole: 0.1876421 -1.2868842 -0.0044286 debye
dipolederiv: -1.9348427 0.1356371 0.0001072 0.491114 -0.5164249 -0.000562 0.0003689 -0.0005367 -0.2813601 -0.1343842 0.0578393 0.0002791 0.0372158 -0.5884436 -0.0020579 0.0004791 -0.0018366 -0.1125875 -0.694681 -0.1427787 -0.0003551 0.0184558 -1.0236969 -0.0015464 -0.0003377 -0.0017449 -0.3178223 -0.1288516 0.0278745 -0.0002207 -0.0206372 0.0351006 0.001082 -0.0001321 0.000488 0.155556 0.0828596 0.0277628 -0.000377 0.1370977 0.0782193 0.0010775 -0.0013686 0.0014529 0.1806738 1.0476879 0.0266271 -0.0005241 0.1118071 0.2415568 -0.0004292 0.0011759 -0.0006963 0.3601411 -0.0541142 0.0545164 -0.000748 0.0031671 0.0387351 0.0009375 -0.000034 0.000867 0.0943158 2.2032331 0.2719349 0.0007443 -0.2137924 1.4057681 0.0024013 -0.0006513 0.002654 0.2803726 -0.4860944 -0.390257 -0.0013547 -0.6330134 -0.0781755 0.0005735 -0.0019021 0.0002491 -0.0072086 0.2554361 0.0408292 -0.0001983 0.2199494 0.0095966 0.0004253 0.0001994 0.0003948 -0.1378651 -0.2868333 0.0344674 0.0002015 0.222905 -0.0033663 0.0006294 0.0010928 0.0008347 -0.2083208 -0.0583886 -0.0287606 -0.0002641 -0.2057552 0.310403 0.0018847 -0.0009759 0.0016914 -0.099185 0.059856 -0.0201174 -0.01696 -0.0024832 -0.0187569 -0.1047308 -0.0278322 -0.1164254 -0.0700492 0.060082 -0.0194479 0.0169107 -0.00185 -0.0166545 0.1041655 0.0276538 0.1160316 -0.0728286 0.035256 0.0079852 -0.0000524 -0.0220384 -0.0462269 -0.1242513 -0.0261382 -0.1459125 -0.0829758 0.0342824 0.0071713 0.0004483 -0.0220891 -0.0398366 0.1231625 0.0272973 0.1449176 -0.089062 -0.0628213 -0.0034138 0.0012342 -0.0600631 -0.0011988 -0.0808445 -0.0208842 -0.0943116 -0.0619975 -0.0637666 -0.0039059 -0.0007886 -0.0602248 -0.0006313 0.0808856 0.0210588 0.0946418 -0.0635726 0.0871783 -0.0179229 0.0468757 0.0307256 -0.0157644 0.1130117 0.0025896 0.1363605 -0.0896447 0.087352 -0.0188656 -0.0460533 0.0309702 -0.0225245 -0.1148938 -0.0030587 -0.1381925 -0.0830226 -0.2140179 -0.0556226 0.0005471 -0.0848555 0.0433834 0.0007302 0.0007876 0.0007099 0.1023241 0.0730981 0.0662205 0.0004437 0.0782075 0.0947537 -0.0004334 0.0004945 -0.0004299 0.1874791 0.06072 -0.0766362 -0.000174 -0.086397 0.0239649 -0.0006494 -0.0001702 -0.0006458 0.2008276 0.0317543 0.0188629 0.0002783 0.0315841 0.0902197 -0.000568 0.0002875 -0.000561 0.2158122 unknown
polarizability: 157.032961|8.6775821|106.4442701|0.0263422|0.1144293|62.6838024 unknown
InChI: InChI=1S/C9H12O3/c1-2-3-6-12-9(10)8-5-4-7-11-8/h4-5,7H,2-3,6H2,1H3
charge 0 multiplicity 1
24 atoms
O  0.549051 -0.023458 -0.002391
O  -3.017125 0.751816 0.002486
O  -0.472566 2.088548 0.002906
C  2.94195 -0.448366 0.002124
C  4.373667 0.139259 -0.002011
C  1.880989 0.651512 -0.00256
C  5.459725 -0.957207 0.013473
C  -0.559809 0.837698 -0.000059
C  -1.79495 0.044956 -0.001616
C  -2.049448 -1.324062 -0.00694
C  -3.480953 -1.489123 -0.006163
C  -4.028822 -0.21245 -0.000362
H  2.800383 -1.096426 -0.884172
H  2.801759 -1.087072 0.895414
H  4.503929 0.800988 0.878236
H  4.507431 0.779868 -0.897148
H  1.945366 1.300622 0.890857
H  1.947548 1.295475 -0.89957
H  5.370542 -1.591875 0.915019
H  5.372223 -1.616011 -0.870812
H  6.473726 -0.517894 0.008413
H  -1.288535 -2.100551 -0.010977
H  -4.033416 -2.426244 -0.009497
H  -5.044064 0.174596 0.002351
