program: Gaussian 09
title: 000134580
version: EM64L-G09RevD.01
frameworkgroup: C1[X(C23H32O3)]
method: RPBEPBE
basis: SDD
operation: Freq
keyword: #pfreq=noraman
keyword: PBEPBE/SDD
title: #p freq=noraman PBEPBE/SDD
converged: YES YES NO NO
title: Mulliken charges:
elementType: O O O C C C C C C C C C C C C C C C C C C C C C C C H H H H H H H H H H H H H H H H H H H H H H H H H H H H H H H H
charge: -0.214800 -0.295671 -0.231342 0.383341 -0.116185 -0.177680 -0.096519 -0.234989 -0.529680 0.254893 -0.545154 -0.548264 -0.476592 -0.512396 -0.828618 0.542810 -0.536413 -0.467752 -0.829065 0.158689 -0.530047 -0.580670 0.345234 -0.802607 0.257718 -0.748794 0.203575 0.244361 0.199149 0.232470 0.198368 0.202682 0.231079 0.210954 0.209178 0.234691 0.261430 0.208795 0.225169 0.217772 0.250950 0.222871 0.227591 0.221482 0.218818 0.211829 0.223841 0.218184 0.249035 0.225395 0.272293 0.247799 0.241608 0.249454 0.253683 0.251781 0.247984 0.246282
chargesum: 0.00000
title: Mulliken charges with hydrogens summed into heavy atoms:
elementType: O O O C C C C C C C C C C C C C C C C C C C C C C C
charge: -0.214800 -0.295671 -0.231342 0.383341 0.087390 0.066681 0.102630 -0.002519 -0.128630 0.254893 -0.103120 -0.104395 -0.006366 -0.069455 -0.127207 0.542810 -0.096113 -0.255923 -0.138005 0.158689 -0.032359 -0.332871 0.345234 -0.057861 0.257718 -0.002747
polarizability: 3.55335073e+02 -2.28200441e+01 2.38023518e+02 -1.36796488e+00 -1.33962348e+00 1.83894714e+02
1716.lowfreq: -11.1571 -6.5145 -1.2729 -0.0011 -0.0009 0.0004 22.3875 35.8124 45.0352
frequency: 22.3545 35.5791 44.9948 49.0831 53.7798 65.9898 76.9784 95.7921 99.9917 116.2096 135.0995 158.8557 164.1488 180.0587 193.0692 204.4227 218.5397 232.9812 254.2808 254.4203 265.8578 279.4302 285.6927 294.9086 315.0238 333.2037 354.6982 356.7760 365.1152 403.4287 417.6615 433.6117 447.0446 453.3260 477.5459 488.4297 499.2396 527.6000 554.8335 559.9671 578.4424 581.1488 614.4944 637.9366 646.9370 681.7818 698.1381 709.9851 733.4694 768.9081 792.0692 815.6489 821.9288 829.2390 837.5113 875.6944 885.7615 903.1387 913.2006 917.6385 922.5966 933.1631 949.9823 955.2988 969.0288 977.2189 981.1646 988.9012 996.0573 1005.5532 1022.6995 1026.5042 1035.0305 1038.6208 1042.4972 1060.0803 1075.0633 1081.0837 1090.1594 1098.3796 1122.8145 1130.8265 1134.3243 1139.2868 1144.6638 1161.7593 1175.0175 1182.2352 1188.6805 1190.8581 1205.4480 1210.5703 1214.4264 1225.7607 1234.5138 1242.9471 1251.5733 1266.7381 1274.2867 1289.5142 1292.7167 1299.2938 1310.3067 1319.2373 1324.1938 1327.0433 1331.8783 1336.9770 1341.3992 1349.6486 1357.5297 1363.8692 1364.9084 1372.7692 1383.4523 1396.4352 1405.8105 1443.4479 1451.8666 1452.2159 1453.0235 1453.8874 1458.7653 1460.8941 1466.5620 1468.6081 1473.1432 1477.1853 1480.2138 1491.2185 1491.9343 1496.1217 1621.6108 1646.2265 1658.9779 1672.1017 2904.1943 2915.8637 2920.1214 2950.2587 2970.3937 2973.2525 2977.2458 2977.5961 2981.2948 2987.1252 2988.0979 2989.6192 2990.4224 2997.1712 3007.6647 3011.9421 3013.1056 3031.4597 3042.5534 3049.5819 3052.6073 3062.3450 3073.3496 3074.1219 3077.1505 3083.1563 3084.2604 3091.8241 3096.0214 3118.3783 3127.7882 3143.5570
redmass: 5.1809 4.0077 4.0341 1.6225 3.8038 2.2989 2.9971 3.4223 3.6034 1.0580 2.2544 4.4421 3.6550 2.0602 3.0792 2.3053 1.4757 2.7981 1.8343 1.7893 2.6457 2.2468 2.8146 3.0369 3.2050 2.6610 2.8513 3.2768 2.7223 2.8963 3.7417 3.3048 3.1163 3.0694 4.0108 3.6793 2.6081 2.9451 3.1927 3.2085 3.7665 3.5244 3.6424 2.4098 3.5570 4.7761 3.0031 2.6086 3.4186 2.2005 1.7394 2.7430 1.8375 1.7374 1.9511 1.9670 3.1114 1.5342 2.1292 2.0424 2.4133 1.8401 1.8990 2.0310 1.9305 2.0638 2.0802 1.9268 2.2404 2.1425 2.3016 1.8368 1.9320 1.6470 2.1473 2.2412 2.4114 2.7987 2.3527 1.7258 1.9509 2.0140 2.4095 1.5531 1.7732 1.7700 1.9617 2.6198 2.2041 1.8690 1.8335 1.4778 1.5324 1.5059 1.4761 1.3947 1.3903 1.5690 1.3387 1.4023 1.2999 1.5055 1.4945 1.4504 1.4728 1.3912 1.4380 1.4282 1.6699 1.5018 2.3485 1.5950 1.2513 1.5854 1.2403 1.2330 1.1923 1.0736 1.0853 1.0645 1.0565 1.0511 1.0794 1.0736 1.0872 1.0799 1.0724 1.0681 1.0742 1.0744 1.0623 1.0601 7.3321 7.6213 9.2240 7.9382 1.0808 1.0807 1.0676 1.0603 1.0794 1.0793 1.0612 1.0426 1.0408 1.0533 1.0610 1.0502 1.0662 1.0824 1.0370 1.0694 1.0896 1.0975 1.1014 1.0999 1.0997 1.0941 1.0980 1.0991 1.1026 1.0978 1.0907 1.0991 1.0967 1.1008 1.0915 1.1013
irintensity: 0.1800 0.6354 2.6451 2.1385 0.6010 2.2826 3.2604 1.2402 1.0070 0.3638 1.4841 1.4553 0.0582 0.7485 0.9866 1.6641 0.0896 0.1777 1.8206 0.8055 2.4013 0.9797 0.4118 2.8940 1.2738 0.8281 2.8059 0.2654 0.4563 0.6587 1.6312 2.0340 3.3517 1.4529 1.3211 0.9229 2.8449 6.2802 6.4895 0.8450 13.0352 0.8996 2.7806 0.8688 7.9089 6.6563 3.3973 2.3189 2.5314 1.2849 4.3674 5.0373 5.0879 1.7913 1.3947 8.5004 65.9481 24.3915 15.6618 14.8808 4.1389 8.7498 6.9679 7.6558 5.6681 2.4859 15.6096 65.9202 6.7623 0.0759 41.0276 1.7867 0.1681 13.0510 3.6801 1.1980 34.5960 85.1032 57.8363 17.0894 35.6810 3.6468 17.6487 1.6132 37.4864 33.1235 93.3096 346.1171 47.1817 8.9103 14.1502 35.5022 5.9694 19.0724 7.2734 5.4707 7.1531 3.1381 6.0000 12.0957 3.8741 1.5084 7.4349 2.1633 1.8818 4.0026 17.8777 0.3015 21.9932 9.7716 21.0504 8.2247 62.9729 24.9483 54.1166 20.5992 30.2067 16.5601 3.1526 18.2619 22.6872 21.1767 4.4791 11.2127 11.5643 11.6619 0.4080 12.2716 5.3189 4.3651 6.6118 11.8459 115.4683 18.3339 158.7968 46.0328 9.4798 18.4765 42.5175 43.8305 15.0037 8.4389 28.6976 17.0609 19.4021 3.3319 32.7641 31.0458 14.1415 65.5371 2.7136 53.5672 29.9271 9.7370 63.0486 25.3196 26.3449 9.1621 22.2822 31.7279 41.9531 17.1905 50.7215 20.7221 7.2502 16.6711 16.1747 11.5834
temp: 298.150 k
press: 1.00000 atm
elementType: 8 8 8 6 6 6 6 6 6 6 6 6 6 6 6 6 6 6 6 6 6 6 6 6 6 6 1 1 1 1 1 1 1 1 1 1 1 1 1 1 1 1 1 1 1 1 1 1 1 1 1 1 1 1 1 1 1 1
symmnumber: 1
zpe: 1306964.6 jmol-1
zpe.correction: 0.497797 hartree
zpe.thermalcorrener: 0.523840 hartree
zpe.thermalcorrenthalpy: 0.524784 hartree
zpe.thermalcorrgfe: 0.441910 hartree
zpe.sumelectzpe: -1119.327005 hartree
zpe.sumelectthermal: -1119.300962 hartree
zpe.sumelectthermalent: -1119.300017 hartree
zpe.sumelectthermalfe: -1119.382892 hartree
dipole: 1.6590 0.3364 -3.7646
dipole: 4.1277
quadrupole: -170.0807 -152.3382 -160.6619
quadrupole: 5.8669 6.2512 5.4086
quadrupole: -9.0538 8.6887 0.3651 5.8669 6.2512 5.4086
hfenergy: -1119.8248017 hartree
pointgroup: C01 [X(C23H32O3)]
dipole: 0.6607693 -0.0417052 1.4828741 debye
polarizability: 354.4392958|25.0184717|238.6250384|-0.5845632|-4.3060443|184.18897 unknown
InChI: InChI=1S/C23H32O3/c1-14(24)19-7-8-20-18-6-5-16-13-17(26-15(2)25)9-11-22(16,3)21(18)10-12-23(19,20)4/h5,13,18-21H,6-12H2,1-4H3
charge 0 multiplicity 1
58 atoms
O  -6.464292 0.481226 -0.97934
O  5.585439 -0.11702 0.461516
O  6.098525 1.40637 -1.250182
C  -3.21311 0.280009 -0.07683
C  -2.429691 -1.013386 0.317709
C  -0.961438 -1.031582 -0.154243
C  -0.213832 0.22069 0.409524
C  -4.630903 -0.091476 0.535382
C  -2.488235 1.480534 0.576086
C  1.280537 0.279277 -0.082032
C  -0.999249 1.535873 0.136535
C  -3.370667 -2.166959 -0.102039
C  -4.803021 -1.610436 0.198157
C  -0.261472 -2.338006 0.293695
C  -3.335127 0.475086 -1.611527
C  1.954321 -1.085762 0.160408
C  2.069926 1.347543 0.743362
C  1.244623 -2.248131 0.293047
C  1.383812 0.620783 -1.600989
C  -5.781726 0.785194 0.038187
C  3.571197 1.420528 0.370084
C  3.420157 -1.1072 0.242281
C  4.161533 0.033441 0.304825
C  -6.077125 2.053867 0.831428
C  6.470516 0.650047 -0.329881
C  7.893556 0.397112 0.116749
H  -2.395156 -1.014149 1.43339
H  -0.936548 -0.995879 -1.262326
H  -0.174201 0.084814 1.516223
H  -4.545249 0.051619 1.63273
H  -2.542863 1.382631 1.681487
H  -2.974777 2.439873 0.307912
H  -0.955914 1.78118 -0.941262
H  -0.511144 2.376484 0.665305
H  -3.164244 -3.100333 0.450954
H  -3.251602 -2.393931 -1.178652
H  -5.476018 -1.718868 -0.669875
H  -5.273829 -2.139139 1.046315
H  -0.592957 -3.181399 -0.345773
H  -0.599743 -2.602598 1.321993
H  -3.955004 -0.308737 -2.078545
H  -3.817684 1.443153 -1.840734
H  -2.349808 0.471414 -2.107916
H  1.972922 1.102356 1.820145
H  1.622266 2.346796 0.591085
H  1.796946 -3.186299 0.456109
H  0.719429 -0.024335 -2.202168
H  1.11485 1.675302 -1.795653
H  2.412164 0.462732 -1.969152
H  4.118392 2.019588 1.124915
H  3.717603 1.94028 -0.595234
H  3.930185 -2.077964 0.267629
H  -6.569156 1.780565 1.78611
H  -5.146667 2.588594 1.093852
H  -6.750851 2.715078 0.264118
H  8.094432 -0.686647 0.157285
H  8.045315 0.796264 1.135385
H  8.592255 0.886632 -0.576565
