program: Gaussian 09
title: 000140774
version: EM64L-G09RevD.01
frameworkgroup: C1[X(C13H11ClOS)]
method: RPBEPBE
basis: SDD
operation: Freq
keyword: #p
keyword: freq=noraman
keyword: PBEPBE/SDD
title: #p freq=noraman PBEPBE/SDD
converged: YES YES NO NO
title: Mulliken charges:
elementType: Cl S O C C C C C C C C C C C C C H H H H H H H H H H H
charge: -0.066487 0.235608 -0.263696 -0.272763 -0.191102 -0.194073 -0.204922 0.329782 -0.340107 -0.337215 -0.138380 -0.233921 -0.226286 -0.204004 -0.094677 -0.537992 0.258552 0.261266 0.246413 0.257159 0.260914 0.246683 0.255280 0.256707 0.223488 0.249394 0.224380
chargesum: 0.00000
title: Mulliken charges with hydrogens summed into heavy atoms:
elementType: Cl S O C C C C C C C C C C C C C
charge: -0.066487 0.235608 -0.263696 -0.272763 -0.191102 0.064479 0.056344 0.329782 -0.093695 -0.080056 0.122534 0.012762 0.028994 0.052703 -0.094677 0.159270
polarizability: 2.60836358e+02 1.00038434e+01 1.53889868e+02 -9.46108646e+00 -1.83638439e+00 1.10415241e+02
1716.lowfreq: -6.8660 -4.2882 -0.0002 0.0016 0.0022 5.9695 8.1026 32.1069 34.0627
frequency: 6.0054 32.0924 34.0453 86.1942 94.3605 143.6747 181.7818 193.3220 224.3265 273.2392 276.6807 301.1961 313.1716 347.0274 406.6546 412.8272 416.5787 474.2432 480.7304 496.3905 525.9842 602.4750 621.7919 627.0947 692.7059 707.9413 715.6208 770.9099 811.9466 816.1310 823.5589 836.2193 943.4718 944.5822 959.9495 966.0410 983.8827 987.7637 993.2502 1059.4872 1071.6077 1081.3444 1103.7283 1108.2461 1111.3915 1155.0252 1174.9093 1184.1917 1230.5639 1287.1539 1288.4040 1355.7883 1363.1231 1387.2829 1406.6007 1434.5767 1457.2555 1467.3567 1470.2191 1479.6521 1572.6615 1577.9894 1579.9262 1603.1717 2963.7605 3053.3951 3129.1119 3140.6525 3147.3040 3150.3316 3151.4798 3169.0831 3170.5650 3173.5660 3175.0374
redmass: 4.1538 6.8043 3.6361 5.4971 5.4425 4.8033 5.2008 5.3119 1.2550 5.8530 6.0879 5.6158 5.1525 10.2033 2.9492 6.0732 3.0655 3.9289 3.3900 7.5515 2.9178 6.3931 7.1814 7.0973 3.9569 6.5865 3.9297 6.0344 1.3362 1.3777 1.2968 1.5231 1.3224 1.3334 1.3563 1.3451 8.4872 5.3574 3.7969 3.9455 2.6052 2.6572 1.3570 1.3553 1.2598 1.3302 1.1970 1.1247 3.5589 1.2615 1.2440 4.8118 5.0874 4.0938 4.1195 1.1865 2.1228 1.0557 1.2176 1.7779 7.3500 7.5398 6.4167 6.3440 1.0328 1.1041 1.0996 1.0895 1.0884 1.0882 1.0887 1.0958 1.0959 1.0968 1.0973
irintensity: 1.2391 0.0722 0.4751 1.6720 1.6622 3.4102 0.4824 1.0648 0.0795 2.5700 0.3244 2.2193 0.2825 7.4100 0.2346 3.3800 0.2094 11.4576 27.1059 30.6122 17.0972 14.6615 0.2650 1.8552 0.4310 3.8520 1.4492 2.6674 31.1317 40.9935 12.3098 60.5921 0.1692 0.0881 0.4913 0.1826 42.3470 97.1688 5.9927 17.1326 38.5816 10.2059 13.6186 4.5076 0.1895 1.9910 77.5695 1.5397 212.4454 1.3246 0.8269 2.5155 9.8187 2.5595 1.5018 21.9459 147.1341 18.0005 105.4800 43.8183 13.6344 0.3272 4.5953 80.6961 62.7573 44.5425 24.4519 3.9952 4.3613 0.7762 3.0766 10.5381 5.6586 3.0869 3.5918
temp: 298.150 k
press: 1.00000 atm
elementType: 17 16 8 6 6 6 6 6 6 6 6 6 6 6 6 6 1 1 1 1 1 1 1 1 1 1 1
symmnumber: 1
zpe: 526128.4 jmol-1
zpe.correction: 0.200392 hartree
zpe.thermalcorrener: 0.215423 hartree
zpe.thermalcorrenthalpy: 0.216367 hartree
zpe.thermalcorrgfe: 0.154392 hartree
zpe.sumelectzpe: -1434.172463 hartree
zpe.sumelectthermal: -1434.157432 hartree
zpe.sumelectthermalent: -1434.156488 hartree
zpe.sumelectthermalfe: -1434.218463 hartree
dipole: -3.4936 -1.1981 -1.4418
dipole: 3.9648
quadrupole: -103.5670 -106.0316 -104.3944
quadrupole: 15.3279 4.9130 2.6260
quadrupole: 1.0973 -1.3673 0.2699 15.3279 4.9130 2.6260
hfenergy: -1434.3728548 hartree
pointgroup: C01 [X(C13H11Cl1O1S1)]
dipole: -1.3614644 -0.6445539 -0.4052022 debye
polarizability: 261.6051384|6.1723981|146.6796655|-7.0407644|-16.0023596|116.8566626 unknown
InChI: InChI=1S/C13H11ClOS/c1-15-11-4-8-13(9-5-11)16-12-6-2-10(14)3-7-12/h2-9H,1H3
charge 0 multiplicity 1
27 atoms
Cl 5.491627 -1.642883 0.916859
S  0.476231 1.985165 -0.996626
O  -4.558926 -0.973028 0.632186
C  -1.018118 1.029381 -0.502955
C  1.854035 0.896076 -0.425601
C  -1.465868 -0.050716 -1.294442
C  -1.761385 1.421734 0.63837
C  -3.380617 -0.357528 0.194918
C  -2.641208 -0.754921 -0.949505
C  -2.939568 0.734881 0.985798
C  1.669573 -0.191412 0.458792
C  3.152947 1.209291 -0.899305
C  2.777045 -0.968895 0.86773
C  4.265042 0.441456 -0.4896
C  4.059086 -0.640187 0.38902
C  -5.063249 -2.111256 -0.14279
H  -0.89519 -0.344532 -2.181357
H  -1.415208 2.261746 1.248696
H  -2.96782 -1.590541 -1.575017
H  -3.528927 1.023525 1.861003
H  0.671109 -0.43977 0.831514
H  3.303243 2.045652 -1.590647
H  2.638016 -1.81169 1.551099
H  5.268001 0.680363 -0.854719
H  -4.332631 -2.943058 -0.155768
H  -5.977769 -2.428619 0.378703
H  -5.30917 -1.813635 -1.180356
