program: Gaussian 09
title: 000140764
version: EM64L-G09RevD.01
frameworkgroup: C1[X(C6H2F8O2)]
method: RPBEPBE
basis: SDD
operation: Freq
keyword: #pfreq=noraman
keyword: PBEPBE/SDD
title: #p freq=noraman PBEPBE/SDD
converged: YES YES NO NO
title: Mulliken charges:
elementType: F F F F F F F F O O C C C C C C H H
charge: -0.126965 -0.158141 -0.153085 -0.119998 -0.118494 -0.153779 -0.155311 -0.116618 -0.085940 -0.101960 0.189582 -0.608355 0.171571 0.389001 0.170689 0.343707 0.320124 0.313973
chargesum: 0.00000
title: Mulliken charges with hydrogens summed into heavy atoms:
elementType: F F F F F F F F O O C C C C C C
charge: -0.126965 -0.158141 -0.153085 -0.119998 -0.118494 -0.153779 -0.155311 -0.116618 -0.085940 -0.101960 0.189582 0.025743 0.171571 0.389001 0.170689 0.343707
polarizability: 8.15139143e+01 -3.11922921e+00 6.45939017e+01 1.10532209e+00 -1.31486671e+00 7.04069556e+01
1716.lowfreq: -5.8630 -5.1618 0.0005 0.0008 0.0012 3.2652 14.8926 20.7421 31.1085
frequency: 14.7973 20.5180 30.9648 48.6191 56.6694 111.9128 123.6034 167.3018 191.7722 201.8561 219.9457 254.8390 279.5258 315.6886 327.9917 339.7877 374.6894 422.8057 435.8525 463.8607 491.0680 495.6968 523.9240 569.0858 596.4528 601.3927 655.8481 685.0513 823.5607 906.4657 915.3485 970.0541 998.4771 1009.6332 1034.3174 1053.1402 1071.3180 1080.2874 1124.0095 1174.6202 1191.1829 1221.8070 1304.2029 1427.9673 1656.2389 1693.6367 3001.8320 3069.3383
redmass: 12.8424 17.3772 13.5451 10.3385 14.7277 13.8681 9.5615 12.8729 15.9337 16.5301 5.6027 14.5762 15.3751 15.1628 7.5868 15.2385 13.5524 5.6149 11.3879 16.5267 9.1698 13.2326 9.4352 4.9731 12.6130 6.7296 15.7608 12.6565 7.4650 5.2968 4.4615 5.2547 8.0385 10.3485 8.1956 10.5284 11.2298 8.3363 3.0562 4.6725 8.6944 1.7248 1.7856 1.1228 10.8255 11.3728 1.0618 1.0970
irintensity: 0.6692 0.0433 0.7368 2.7947 0.6276 3.9657 3.5578 1.0472 7.4528 4.0251 6.2683 0.5120 0.5292 0.3223 3.4122 2.7111 4.6566 5.7651 1.7880 10.7582 8.2011 11.5935 2.7693 3.6574 29.1367 21.1675 12.2478 1.6983 13.0937 121.2017 27.1785 90.4240 194.2288 97.2602 23.7245 308.2760 324.4660 81.4642 35.5645 117.2864 63.2545 14.8115 119.6396 47.0608 77.2760 91.9738 6.7058 3.3874
temp: 298.150 k
press: 1.00000 atm
elementType: 9 9 9 9 9 9 9 9 8 8 6 6 6 6 6 6 1 1
symmnumber: 1
zpe: 213826.3 jmol-1
zpe.correction: 0.081442 hartree
zpe.thermalcorrener: 0.097450 hartree
zpe.thermalcorrenthalpy: 0.098394 hartree
zpe.thermalcorrgfe: 0.034110 hartree
zpe.sumelectzpe: -1177.760307 hartree
zpe.sumelectthermal: -1177.744299 hartree
zpe.sumelectthermalent: -1177.743355 hartree
zpe.sumelectthermalfe: -1177.807640 hartree
dipole: 0.6692 0.7934 2.2674
dipole: 2.4937
quadrupole: -97.0447 -89.9779 -93.3460
quadrupole: 3.8063 0.9674 2.5586
quadrupole: -3.5885 3.4783 0.1102 3.8063 0.9674 2.5586
hfenergy: -1177.8417494 hartree
pointgroup: C01 [X(C6H2F8O2)]
dipole: 0.266648 -0.2121369 0.9200155 debye
dipolederiv: -0.5969514 0.2250702 -0.0008348 0.2116892 -0.3929769 -0.0135648 0.0568862 -0.0596836 -0.2572361 -0.3481617 -0.0253292 0.0248946 0.0227834 -0.3976472 0.1514858 -0.0605946 0.2082426 -0.5659037 -0.6497837 0.1684982 -0.0363894 0.2584292 -0.5029112 -0.0254417 0.0057118 -0.0824101 -0.2904125 -0.2841136 0.0054712 -0.0598326 -0.0175412 -0.3857248 0.1206094 -0.0703652 0.2041158 -0.6424627 -0.734201 -0.2586962 0.0865354 -0.3488759 -0.4500315 0.0328531 -0.0001281 -0.0287482 -0.2975029 -0.420614 0.0286821 -0.0036285 -0.031228 -0.6611684 0.2216837 0.0409701 0.232945 -0.4105817 -0.5471371 -0.1380107 -0.1744644 -0.0880302 -0.5054374 -0.1674022 -0.1597948 -0.2090288 -0.4548837 -0.5993039 0.117964 0.2892849 0.1292533 -0.2978934 -0.1033344 0.2504166 -0.0824652 -0.5738093 -0.4727302 -0.0277363 -0.0123356 0.0796852 -0.6429161 0.0278351 -0.090187 0.1300879 -0.1896275 -0.3912507 0.0590621 -0.061829 0.071104 -0.2175133 0.0577548 0.1124744 -0.0144628 -0.6757384 0.7142316 -0.2801313 -0.048177 -0.3533187 0.6628695 -0.1144552 -0.0913616 -0.1419728 0.8493173 -0.7155675 0.2663411 0.1593355 0.1761486 -0.0633364 -0.0082048 0.2362991 -0.0315033 -0.3520606 1.0671872 0.0041116 0.0801192 -0.1146865 0.8018419 -0.0504127 0.2157369 -0.2911566 0.0071953 1.6069713 0.0530722 -0.0140844 0.1372538 1.3345376 -0.1445694 0.1574244 -0.0311203 1.2280743 0.7988352 -0.2650347 -0.1439178 -0.2386645 0.1296691 -0.0096478 -0.4034163 0.1054534 0.9744859 1.3492531 0.0905647 -0.1149413 0.0843891 1.4621766 0.0566966 -0.12521 0.0588559 1.3557474 0.140433 0.0064985 0.0447019 0.0151685 0.0424295 0.0154728 -0.0129287 0.0274707 0.1488887 0.0829033 -0.0303974 -0.0144366 0.0064405 0.0840323 -0.0473584 -0.0619333 0.0053803 0.1465102 unknown
polarizability: 81.1158013|-3.9945272|67.7146099|-1.0499098|-3.0869718|67.6843605 unknown
InChI: InChI=1S/C6H2F8O2/c7-4(8,6(12,13)14)2(15)1-3(16)5(9,10)11/h1H2
charge 0 multiplicity 1
18 atoms
F  -3.012535 1.221641 0.695025
F  -1.873049 -0.413287 1.827208
F  -1.178389 -1.624491 -0.631558
F  -2.340753 -0.0321 -1.769921
F  -3.416687 -1.396366 -0.309552
F  2.8125 -1.677763 0.689233
F  3.676713 0.425987 0.795179
F  3.770052 -0.746011 -1.149938
O  -0.614671 2.301264 0.051558
O  1.280805 0.330502 -1.606277
C  -1.932698 0.327357 0.603707
C  0.693466 0.380075 0.800443
C  -0.587138 1.121822 0.439641
C  -2.23667 -0.690789 -0.542345
C  1.579417 0.119086 -0.422508
C  2.977269 -0.476616 -0.044269
H  0.498391 -0.580551 1.309797
H  1.271076 1.007038 1.508778
