program: Gaussian 09
title: 000140759
version: EM64L-G09RevD.01
frameworkgroup: C1[X(C9H18O)]
method: RPBEPBE
basis: SDD
operation: Freq
keyword: #pfreq=noraman
keyword: PBEPBE/SDD
title: #p freq=noraman PBEPBE/SDD
converged: YES YES NO NO
title: Mulliken charges:
elementType: O C C C C C C C C C H H H H H H H H H H H H H H H H H H
charge: -0.216053 -0.154833 -0.393667 -0.355393 -0.352094 0.217170 -0.723336 -0.492684 -0.697697 -0.673914 0.205838 0.223036 0.190179 0.208510 0.177930 0.202075 0.190762 0.237315 0.223951 0.213578 0.229681 0.234014 0.212198 0.207409 0.216089 0.235767 0.209736 0.224433
chargesum: 0.00000
title: Mulliken charges with hydrogens summed into heavy atoms:
elementType: O C C C C C C C C C
charge: -0.216053 0.051005 0.019549 0.031046 0.040743 0.217170 -0.048491 -0.028989 -0.062001 -0.003978
polarizability: 1.10165106e+02 1.21168833e+00 9.83863786e+01 2.12172254e+00 -6.47948345e-01 8.91739727e+01
1716.lowfreq: -15.8338 -4.2272 -0.0011 -0.0009 -0.0009 14.9769 21.1177 53.0562 56.2882
frequency: 19.7786 52.8384 56.0474 88.3926 111.0174 132.9288 176.7498 191.9164 216.3254 225.2447 231.9951 259.3950 306.3048 328.5756 417.4510 480.0059 557.5081 608.2105 726.3916 746.4947 795.0528 802.9177 884.0194 896.8516 922.3741 978.3293 1004.1906 1009.6124 1026.8554 1042.9406 1060.9576 1081.2578 1103.8324 1113.7083 1120.8176 1160.0612 1214.3021 1239.7956 1250.4270 1277.0297 1286.0265 1292.4742 1319.6636 1331.6803 1349.4234 1351.1584 1383.7758 1389.4051 1397.6488 1430.5726 1454.5377 1465.5998 1470.1380 1472.7953 1475.4407 1477.5121 1478.8640 1480.3041 1486.3295 1629.9718 2952.6286 2956.2780 2966.6443 2972.0245 2973.6098 2976.0261 2978.7539 2996.5957 2997.2738 3003.3308 3022.3653 3045.7260 3068.6683 3071.2371 3072.3662 3086.4923 3092.0089 3100.0539
redmass: 4.3604 1.5794 3.2911 1.7430 2.9686 2.2410 1.2996 1.8835 1.9580 1.2153 1.2836 2.4771 3.8321 3.5376 3.0264 2.7831 2.0592 2.8102 1.2244 1.7402 1.4397 1.3794 2.3144 1.5753 1.3331 2.2344 1.6550 1.9962 1.6956 2.4046 1.7862 2.2113 1.9980 2.0173 2.1940 2.3158 1.4547 1.1982 1.2738 1.2412 1.2899 1.0806 1.4823 1.4339 1.7179 1.5826 1.2180 1.2170 1.2104 1.0922 1.0770 1.0723 1.0396 1.0472 1.0655 1.0426 1.0517 1.0603 1.0795 7.6415 1.0592 1.0628 1.0595 1.0368 1.0627 1.0716 1.0442 1.0377 1.0951 1.0941 1.1016 1.1029 1.1006 1.0993 1.0995 1.1007 1.1004 1.0997
irintensity: 2.6804 0.2894 2.1319 0.4781 0.3804 0.1803 0.7420 0.9407 0.1096 0.3239 0.2242 0.0306 12.0420 1.2631 0.0847 0.4285 0.2861 0.7466 13.0788 0.1618 6.4646 4.2295 2.3579 1.2864 1.0774 45.6961 4.7446 5.1955 17.0499 4.3095 1.5752 3.1188 20.1549 17.3716 2.9652 11.4859 4.1514 0.7657 1.5499 3.4447 1.2595 1.5429 11.6911 3.9956 21.7729 1.3058 20.5532 7.0743 20.3994 21.5734 3.9089 0.2196 12.3530 16.9664 5.5281 11.4870 8.1052 16.6663 17.4903 69.6113 9.9027 22.3935 29.6459 36.9359 20.2485 74.6033 27.7254 28.3095 7.0365 12.7380 11.3569 38.1780 84.2326 53.9360 42.8638 28.0162 32.1613 28.4046
temp: 298.150 k
press: 1.00000 atm
elementType: 8 6 6 6 6 6 6 6 6 6 1 1 1 1 1 1 1 1 1 1 1 1 1 1 1 1 1 1
symmnumber: 1
zpe: 655998.0 jmol-1
zpe.correction: 0.249856 hartree
zpe.thermalcorrener: 0.263310 hartree
zpe.thermalcorrenthalpy: 0.264254 hartree
zpe.thermalcorrgfe: 0.208558 hartree
zpe.sumelectzpe: -428.146233 hartree
zpe.sumelectthermal: -428.132780 hartree
zpe.sumelectthermalent: -428.131836 hartree
zpe.sumelectthermalfe: -428.187532 hartree
dipole: -0.0715 0.7644 -2.7252
dipole: 2.8313
quadrupole: -62.4317 -62.6237 -67.7117
quadrupole: -0.1436 4.1388 1.0156
quadrupole: 1.8240 1.6320 -3.4560 -0.1436 4.1388 1.0156
hfenergy: -428.3960896 hartree
pointgroup: C01 [X(C9H18O1)]
dipole: -0.050048 0.3724777 -1.0486006 debye
polarizability: 110.2646097|1.0048588|98.421096|1.7186427|-0.0562638|89.0397514 unknown
InChI: InChI=1S/C9H18O/c1-4-6-7-8(3)9(10)5-2/h8H,4-7H2,1-3H3
charge 0 multiplicity 1
28 atoms
O  -1.268732 -0.429873 1.426516
C  -0.552367 1.107247 -0.335169
C  0.905074 1.092067 0.189832
C  1.744114 -0.090943 -0.342863
C  3.201306 -0.074601 0.172464
C  -1.368306 -0.076758 0.220343
C  -1.285423 2.419696 0.068542
C  -2.319898 -0.775715 -0.752586
C  4.042651 -1.253408 -0.362584
C  -3.278573 -1.777798 -0.088272
H  -0.546425 1.037832 -1.442771
H  0.873408 1.053623 1.29628
H  1.394029 2.047266 -0.091267
H  1.26798 -1.046442 -0.041651
H  1.750699 -0.074016 -1.453673
H  3.192178 -0.097612 1.280963
H  3.679665 0.884194 -0.115383
H  -1.307571 2.519532 1.168518
H  -0.756599 3.294647 -0.350773
H  -2.327985 2.442975 -0.300061
H  -2.872436 0.002011 -1.319689
H  -1.683666 -1.283132 -1.510319
H  3.599392 -2.222616 -0.065416
H  4.096483 -1.234091 -1.467766
H  5.077125 -1.222141 0.026282
H  -2.714881 -2.541834 0.473426
H  -3.905892 -2.283514 -0.843769
H  -3.94075 -1.269297 0.633947
