program: Gaussian 09
title: 000140746
version: EM64L-G09RevD.01
frameworkgroup: C1[X(C2H5N)]
method: RPBEPBE
basis: SDD
operation: Freq
keyword: #p
keyword: freq=noraman
keyword: PBEPBE/SDD
title: #p freq=noraman PBEPBE/SDD
converged: NO YES NO NO
title: Mulliken charges:
elementType: N C C H H H H H
charge: -0.274062 -0.668391 -0.175521 0.249989 0.224046 0.224048 0.191703 0.228188
chargesum: 0.00000
title: Mulliken charges with hydrogens summed into heavy atoms:
elementType: N C C
charge: -0.045875 0.029692 0.016182
polarizability: 3.94623969e+01 -3.03627381e+00 2.78098498e+01 2.65107837e-05 1.68334869e-04 1.88833363e+01
1716.lowfreq: -22.6905 -16.7383 0.0001 0.0002 0.0008 38.7282 188.7979 470.7972 675.9592
frequency: 188.7880 470.7969 675.9571 924.5058 1038.4542 1054.9947 1097.8509 1239.5485 1359.9100 1386.4120 1448.6441 1459.9230 1642.7785 2926.4172 2975.3111 3053.4509 3113.7837 3304.3780
redmass: 1.2296 2.3688 1.1099 2.0992 1.4123 1.3125 1.3843 1.3961 1.3402 1.3405 1.0632 1.0486 4.5052 1.0844 1.0384 1.0964 1.0993 1.0775
irintensity: 0.9091 19.3621 98.0294 10.6417 36.0371 8.5008 2.5493 49.1934 26.1066 16.3677 22.4088 20.6955 51.2588 83.7803 13.1606 23.2484 16.5265 21.1076
temp: 298.150 k
press: 1.00000 atm
elementType: 7 6 6 1 1 1 1 1
symmnumber: 1
zpe: 175623.2 jmol-1
zpe.correction: 0.066891 hartree
zpe.thermalcorrener: 0.070853 hartree
zpe.thermalcorrenthalpy: 0.071797 hartree
zpe.thermalcorrgfe: 0.041937 hartree
zpe.sumelectzpe: -133.683795 hartree
zpe.sumelectthermal: -133.679833 hartree
zpe.sumelectthermalent: -133.678889 hartree
zpe.sumelectthermalfe: -133.708749 hartree
dipole: -0.7810 2.1235 0.0000
dipole: 2.2625
quadrupole: -16.8516 -20.0202 -19.8054
quadrupole: 2.6578 0.0001 0.0000
quadrupole: 2.0408 -1.1278 -0.9130 2.6578 0.0001 0.0000
hfenergy: -133.7506865 hartree
pointgroup: C01 [X(C2H5N1)]
dipole: -0.357106 0.8153782 0.0000195 debye
dipolederiv: -0.5942907 0.1629151 0.0000047 0.3593186 -0.2399258 0.000006 0.0000082 0.0000054 -0.4597681 -0.3510009 -0.0934619 -0.0000015 -0.0896144 -0.037971 -0.0000027 0.0000058 -0.0000038 0.0599888 0.7764578 -0.0247951 0.0000006 -0.0085297 0.4237126 0.0000111 -0.0000016 0.0000148 -0.1015616 0.0984222 0.0442889 0.0000027 -0.0269523 -0.1038699 -0.0000115 -0.0000019 -0.000011 0.1206736 0.0261041 0.0191579 -0.0924867 0.005299 0.0882608 0.083344 -0.1205068 0.0616799 -0.0437561 0.0261085 0.0191487 0.0924863 0.0052847 0.0882762 -0.08333 0.1205035 -0.0616676 -0.0437693 -0.0124471 0.033216 -0.000001 0.0172292 -0.2899735 -0.0000109 0. -0.0000113 0.1895479 0.0306461 -0.1604697 -0.0000052 -0.2620351 0.0714906 -0.0000061 -0.0000071 -0.0000063 0.2786448 unknown
polarizability: 39.7856091|-2.3126276|27.4866375|0.0000163|0.0001696|18.8833363 unknown
InChI: InChI=1S/C2H5N/c1-2-3/h2-3H,1H3
charge 0 multiplicity 1
8 atoms
N  1.18808 -0.245525 -0.000014
C  -1.264007 -0.188313 -0.000022
C  0.093618 0.468492 -0.000005
H  -1.159693 -1.28506 -0.000079
H  -1.844941 0.123716 -0.889733
H  -1.844927 0.123631 0.889727
H  0.074037 1.583058 0.000022
H  2.050633 0.3412 0.000005
