program: Gaussian 09
title: 000140748
version: EM64L-G09RevD.01
frameworkgroup: C1[X(C12H14N2)]
method: RPBEPBE
basis: SDD
operation: Freq
keyword: #pfreq=noraman
keyword: PBEPBE/SDD
title: #p freq=noraman PBEPBE/SDD
converged: YES YES NO NO
title: Mulliken charges:
elementType: N N C C C C C C C C C C C C H H H H H H H H H H H H H H
charge: -0.436131 -0.435268 0.025849 0.476017 0.276897 0.276706 -0.477656 -0.477920 -0.390948 -0.391147 -0.253482 -0.252868 -0.653923 -0.653848 0.234108 0.234082 0.233760 0.233615 0.217984 0.217918 0.318113 0.318471 0.223121 0.235104 0.221731 0.223305 0.234795 0.221613
chargesum: 0.00000
title: Mulliken charges with hydrogens summed into heavy atoms:
elementType: N N C C C C C C C C C C C C
charge: -0.118018 -0.116797 0.025849 0.476017 0.276897 0.276706 -0.243548 -0.243838 -0.157187 -0.157531 -0.035498 -0.034950 0.026034 0.025864
polarizability: 1.96656271e+02 -2.65004819e-02 1.86949210e+02 6.28829281e+00 -6.78379909e-02 7.11209353e+01
1716.lowfreq: -12.6941 -1.4043 -0.0005 0.0002 0.0003 2.6600 64.7554 77.9555 144.7679
frequency: 64.7498 77.9474 144.7645 168.3298 206.7660 229.4604 236.3434 245.2558 276.3603 287.1611 339.8952 341.4335 346.0697 467.9061 479.8691 493.4264 521.4967 528.1098 581.3050 630.1870 648.9303 665.7927 754.4203 756.2469 775.4745 796.3573 820.9244 843.3419 860.2020 878.6335 959.0583 964.1625 969.2834 1009.2914 1063.9728 1086.5966 1109.6449 1111.8417 1122.9464 1139.4424 1153.7557 1174.4473 1188.3752 1199.0487 1232.5589 1289.5466 1312.9379 1349.2187 1373.8448 1404.4954 1422.7755 1439.6905 1443.0152 1450.2092 1465.8352 1468.5342 1476.3404 1495.4472 1501.1603 1509.9219 1539.8236 1599.7351 1605.0840 1619.3002 2928.2850 2929.2532 3025.8741 3026.8078 3087.7456 3088.2174 3122.5967 3123.6311 3144.6404 3147.0524 3167.8299 3168.7892 3476.8610 3484.2167
redmass: 3.5377 2.1631 2.8928 3.2717 3.1437 3.0777 1.5416 1.5990 1.3549 1.9658 3.4823 3.1217 3.1715 5.6927 3.4765 4.0975 4.3139 6.5415 3.6066 3.8786 2.6962 3.7816 1.3461 1.6414 5.1262 3.8831 2.9681 1.4288 1.1920 1.5931 1.3226 3.2389 1.3482 5.5622 2.0612 1.7276 1.6735 1.3326 1.4187 1.4553 2.4858 1.7168 1.1762 1.5113 1.7285 2.9582 1.9410 2.5266 3.3372 5.1415 1.7733 1.2857 1.7270 1.3568 1.2652 1.0550 1.5558 1.1850 1.0736 1.3212 3.5249 4.3648 6.8745 6.1738 1.0472 1.0474 1.0873 1.0871 1.0986 1.0986 1.0856 1.0854 1.0952 1.0940 1.0951 1.0950 1.0787 1.0766
irintensity: 0.0008 12.3237 3.6106 2.6106 1.1804 17.7971 5.2279 21.0026 40.2127 4.6656 3.4430 29.8502 52.2997 6.1368 1.6912 1.4199 0.4401 2.1914 3.0056 11.5653 1.7307 39.2039 1.1282 81.9223 0.6477 6.6208 77.1110 19.9452 83.7836 12.0480 0.1655 1.0830 2.9527 0.5851 20.5634 2.0772 5.6195 10.1257 18.7878 0.8047 23.7723 20.4883 3.4041 0.1769 1.3131 8.3147 54.7844 7.8373 35.9925 21.3812 58.8882 1.7229 6.3046 12.0699 20.6793 9.5982 15.1603 0.1245 15.4814 184.4063 52.6881 19.8875 206.7414 35.4931 172.6709 49.4310 43.0118 44.7418 14.1592 37.1395 7.6210 0.9209 6.8263 58.7309 37.8297 7.6161 19.5711 54.9457
temp: 298.150 k
press: 1.00000 atm
elementType: 7 7 6 6 6 6 6 6 6 6 6 6 6 6 1 1 1 1 1 1 1 1 1 1 1 1 1 1
symmnumber: 1
zpe: 613925.3 jmol-1
zpe.correction: 0.233832 hartree
zpe.thermalcorrener: 0.246404 hartree
zpe.thermalcorrenthalpy: 0.247348 hartree
zpe.thermalcorrgfe: 0.195735 hartree
zpe.sumelectzpe: -574.170768 hartree
zpe.sumelectthermal: -574.158195 hartree
zpe.sumelectthermalent: -574.157251 hartree
zpe.sumelectthermalfe: -574.208865 hartree
dipole: 0.0162 3.4408 -0.0005
dipole: 3.4409
quadrupole: -73.0293 -70.9043 -89.0727
quadrupole: 0.0153 -0.5770 -0.0159
quadrupole: 4.6395 6.7645 -11.4039 0.0153 -0.5770 -0.0159
hfenergy: -574.4045997 hartree
pointgroup: C01 [X(C12H14N2)]
dipole: 0.3683007 -1.3026558 0.0080146 debye
polarizability: 193.7845441|1.8049315|187.4188508|-17.4189916|-5.6440783|73.5230207 unknown
InChI: InChI=1S/C12H14N2/c1-13-10-7-3-5-9-6-4-8-11(14-2)12(9)10/h3-8,13-14H,1-2H3
charge 0 multiplicity 1
28 atoms
N  1.873515 -1.49515 0.099672
N  -0.770086 -2.233711 -0.014691
C  -0.00913 0.14123 0.029958
C  -0.399886 1.539796 0.019158
C  1.411207 -0.169832 -0.091885
C  -1.062974 -0.859527 0.160883
C  0.574932 2.557873 -0.24939
C  -1.762311 1.908785 0.276914
C  2.330415 0.861797 -0.380823
C  -2.384692 -0.449868 0.440527
C  1.906013 2.215621 -0.479316
C  -2.723679 0.929317 0.51806
C  3.304075 -1.812768 0.077825
C  -1.827837 -3.24744 0.00783
H  0.250541 3.604128 -0.271242
H  -2.0276 2.971762 0.282244
H  3.392961 0.630962 -0.493187
H  -3.174371 -1.19605 0.562024
H  2.647146 2.991645 -0.702203
H  -3.760487 1.211678 0.733701
H  1.300122 -2.063228 0.730394
H  0.022032 -2.427825 -0.634437
H  3.891169 -1.245641 0.833494
H  3.735886 -1.597695 -0.916881
H  3.433428 -2.890509 0.275035
H  -2.620214 -3.071701 -0.752858
H  -2.31386 -3.282728 1.000256
H  -1.378213 -4.23692 -0.181763
