program: Gaussian 09
title: 000140739
version: EM64L-G09RevD.01
frameworkgroup: C1[X(C16H14)]
method: RPBEPBE
basis: SDD
operation: Freq
keyword: #p
keyword: freq=noraman
keyword: PBEPBE/SDD
title: #p freq=noraman PBEPBE/SDD
converged: NO YES NO NO
title: Mulliken charges:
elementType: C C C C C C C C C C C C C C C C H H H H H H H H H H H H H H
charge: 0.031325 0.190050 0.402629 0.561660 0.395745 -0.457088 -0.518887 -0.706900 0.557942 -0.623186 -0.414024 -0.410039 -0.844273 -0.271816 -0.203794 -0.822531 0.249276 0.242493 0.195740 0.210898 0.225651 0.200365 0.236132 0.236288 0.237305 0.211223 0.201521 0.231654 0.223056 0.231585
chargesum: 0.00000
title: Mulliken charges with hydrogens summed into heavy atoms:
elementType: C C C C C C C C C C C C C C C C
charge: 0.031325 0.190050 0.402629 0.561660 0.395745 -0.207812 -0.276394 -0.511160 0.557942 -0.412288 -0.188374 -0.209674 -0.134547 -0.060594 -0.002272 -0.136236
polarizability: 2.90682825e+02 -3.66691724e+00 2.27698850e+02 -6.80020822e-02 -9.03324520e-02 7.59227743e+01
1716.lowfreq: -7.9994 -0.0004 0.0003 0.0006 13.6469 14.8985 56.1203 86.9614 121.5167
frequency: 56.0898 86.9553 121.5147 159.7636 192.1349 217.2877 236.5513 262.9065 273.9104 302.7851 317.2653 373.3483 385.4053 408.8242 476.0046 489.6500 504.8172 520.7433 555.0237 596.8179 628.2509 648.9357 681.1806 687.4168 725.9390 750.2131 782.6082 823.3034 856.5945 857.1728 868.7763 902.7281 903.2032 916.7114 939.3188 973.8325 982.2807 998.8565 1022.1627 1040.7013 1043.7349 1047.2058 1049.6008 1097.4630 1125.4968 1166.9960 1201.3007 1232.6683 1237.4733 1239.0142 1294.1070 1322.9184 1344.7649 1391.2288 1397.2148 1402.2201 1418.8249 1430.7652 1458.5914 1463.6518 1468.1765 1474.4471 1478.6281 1493.6262 1507.1734 1538.1776 1548.6465 1610.5178 1621.4687 1628.3170 2972.6818 2975.2589 3048.2983 3050.9225 3081.1594 3087.3591 3089.8965 3093.3385 3096.9756 3101.8728 3109.4266 3138.8957 3173.2399 3207.3590
redmass: 3.5851 3.2944 1.1628 2.4830 2.8524 2.9595 1.2626 3.4257 3.7463 3.0359 5.3153 5.2522 3.1265 5.6999 4.9572 3.0851 5.1418 3.2597 4.3354 2.8147 4.1664 2.8649 4.8189 2.3509 6.0545 1.5688 1.5934 1.7512 1.8952 3.5372 1.3750 1.4097 5.3032 1.6706 4.9555 1.8474 1.3951 1.3526 2.3527 1.9459 1.5811 2.5516 1.6155 1.3159 2.9407 2.8930 2.5284 1.8509 1.6134 2.4079 2.3838 1.5008 2.1181 1.2228 1.2406 1.6782 2.2198 1.5263 1.8269 1.0472 1.0469 1.3547 1.3841 2.7426 2.5577 4.0410 4.5129 8.1497 5.2836 5.4901 1.0376 1.0378 1.0969 1.0966 1.0841 1.0870 1.0924 1.0971 1.0921 1.0900 1.0902 1.0948 1.0914 1.1007
irintensity: 0.0163 1.2768 1.0579 5.7873 0.1618 0.0393 0.2767 1.0757 2.6011 0.2801 1.1724 0.2652 3.3493 0.0143 0.2472 0.9976 0.1223 0.2682 0.3562 1.2778 0.9004 11.4583 0.2740 3.2846 1.4232 53.2500 31.3502 4.3955 25.9343 8.3825 20.9565 1.1487 9.5671 10.9282 8.0338 5.1435 3.3144 0.8451 0.2658 1.2983 2.3751 0.8334 22.9939 20.7721 0.1273 18.0444 3.9837 1.3743 3.0558 16.2435 10.6993 29.9286 4.8273 25.5855 23.7370 5.1688 3.9364 8.0366 50.2127 17.6131 10.7831 5.7726 17.1225 134.4551 21.4985 45.9901 24.8550 112.3286 178.3359 15.4076 32.6530 23.5895 17.4678 16.3343 5.8436 13.5148 2.8289 5.4028 13.6625 45.9097 57.0604 45.5998 10.7674 14.0114
temp: 298.150 k
press: 1.00000 atm
elementType: 6 6 6 6 6 6 6 6 6 6 6 6 6 6 6 6 1 1 1 1 1 1 1 1 1 1 1 1 1 1
symmnumber: 1
zpe: 642927.5 jmol-1
zpe.correction: 0.244878 hartree
zpe.thermalcorrener: 0.257964 hartree
zpe.thermalcorrenthalpy: 0.258908 hartree
zpe.thermalcorrgfe: 0.205963 hartree
zpe.sumelectzpe: -616.964826 hartree
zpe.sumelectthermal: -616.951740 hartree
zpe.sumelectthermalent: -616.950796 hartree
zpe.sumelectthermalfe: -617.003741 hartree
dipole: -1.0914 -0.7469 -0.0015
dipole: 1.3225
quadrupole: -79.1804 -82.3733 -101.2712
quadrupole: -0.4097 -0.0187 -0.0303
quadrupole: 8.4279 5.2350 -13.6629 -0.4097 -0.0187 -0.0303
hfenergy: -617.2097041 hartree
pointgroup: C01 [X(C16H14)]
dipole: 0.4496418 0.2613487 -0.015714 debye
polarizability: 289.808985|-8.0992131|227.8810431|1.8046114|-10.1971025|76.6144208 unknown
InChI: InChI=1S/C16H14/c1-11-9-12(2)15-8-7-13-5-3-4-6-14(10-11)16(13)15/h3-10H,1-2H3
charge 0 multiplicity 1
30 atoms
C  -0.491526 -0.247231 0.046005
C  0.523114 -1.31931 0.125557
C  -1.81309 -0.930503 0.08135
C  -0.270576 1.157259 -0.044988
C  1.968552 -1.251391 0.128378
C  -0.180234 -2.56352 0.203397
C  -1.567817 -2.330624 0.179604
C  1.047561 1.780458 -0.082442
C  2.344828 1.274526 -0.044011
C  2.753995 -0.102777 0.05214
C  -3.142723 -0.412614 0.033768
C  -1.341548 2.151206 -0.112997
C  2.709231 -2.579111 0.223224
C  -3.576526 0.906856 -0.054373
C  -2.729307 2.057478 -0.117353
C  3.493406 2.276713 -0.10958
H  0.289982 -3.544463 0.27287
H  -2.352102 -3.089563 0.225944
H  0.998953 2.875633 -0.156609
H  3.841263 -0.260102 0.06724
H  -3.926452 -1.183688 0.074337
H  -0.966971 3.182235 -0.172874
H  2.445699 -3.24382 -0.62141
H  2.442583 -3.118176 1.152235
H  3.80084 -2.429418 0.214571
H  -4.657971 1.087026 -0.077515
H  -3.254129 3.0219 -0.179712
H  4.133119 2.198914 0.790549
H  3.134742 3.316284 -0.185969
H  4.142405 2.071325 -0.982437
