program: Gaussian 09
title: 000140734
version: EM64L-G09RevD.01
frameworkgroup: C1[X(C8H8)]
method: RPBEPBE
basis: SDD
operation: Freq
keyword: #p
keyword: freq=noraman
keyword: PBEPBE/SDD
title: #p freq=noraman PBEPBE/SDD
converged: NO YES NO NO
title: Mulliken charges:
elementType: C C C C C C C C H H H H H H H H
charge: -0.271933 -0.271933 -0.271933 -0.271934 -0.247129 -0.245602 -0.245601 -0.247129 0.257874 0.257874 0.257874 0.257874 0.264410 0.256440 0.256440 0.264410
chargesum: 0.00000
title: Mulliken charges with hydrogens summed into heavy atoms:
elementType: C C C C C C C C
charge: -0.014059 -0.014060 -0.014059 -0.014060 0.017281 0.010837 0.010839 0.017280
polarizability: 7.26959922e+01 2.50622800e-06 6.61220992e+01 -2.86779153e-04 -1.83817532e-05 6.59177365e+01
1716.lowfreq: -21.1090 -0.0006 0.0005 0.0009 22.2348 26.8580 529.7387 540.7733 676.5844
frequency: 529.7386 540.7729 676.5841 681.7222 738.2893 739.3810 739.9495 743.2183 783.6900 795.3353 842.0078 873.9738 900.3374 903.8218 919.3546 937.9636 938.6373 979.4102 981.6521 1017.8090 1020.3847 1024.0432 1031.3946 1034.2402 1107.0852 1150.6040 1181.0524 1186.2362 1191.6986 1208.9147 1235.6662 1273.1481 1292.3069 1325.3444 3111.1121 3124.2635 3152.3610 3154.5468 3157.4562 3166.7387 3175.2435 3191.7361
redmass: 3.0508 2.7982 3.4761 6.1782 1.8052 5.3630 1.8495 5.2595 2.1674 1.7946 1.8583 1.5228 1.6297 1.9229 1.9308 1.6567 1.6972 3.7350 1.4201 1.5716 1.2690 2.1688 1.3787 1.6259 2.3448 1.3198 1.3554 1.8339 1.9061 1.6546 1.7103 1.7820 4.5010 2.4860 1.0908 1.0927 1.0903 1.0928 1.0920 1.0956 1.1020 1.1059
irintensity: 0.0000 2.7316 0.0000 0.0498 24.8964 1.2392 4.4703 3.0991 0.0000 45.5533 17.1465 4.3977 0.0000 0.4775 0.0000 6.3707 34.3267 0.5346 1.3658 1.2096 0.1029 2.0323 0.0000 5.7508 0.6380 3.4905 0.0000 0.0001 0.0000 0.0756 22.0461 9.5898 0.7246 0.0102 6.2579 36.4134 0.0002 51.6294 6.1098 11.3634 57.4731 6.7028
temp: 298.150 k
press: 1.00000 atm
elementType: 6 6 6 6 6 6 6 6 1 1 1 1 1 1 1 1
symmnumber: 1
zpe: 345476.9 jmol-1
zpe.correction: 0.131585 hartree
zpe.thermalcorrener: 0.136398 hartree
zpe.thermalcorrenthalpy: 0.137343 hartree
zpe.thermalcorrgfe: 0.103199 hartree
zpe.sumelectzpe: -308.937396 hartree
zpe.sumelectthermal: -308.932583 hartree
zpe.sumelectthermalent: -308.931638 hartree
zpe.sumelectthermalfe: -308.965782 hartree
dipole: 0.0000 0.0175 0.0000
dipole: 0.0175
quadrupole: -44.8704 -45.0212 -47.1381
quadrupole: 0.0000 -0.0001 -0.0003
quadrupole: 0.8062 0.6554 -1.4616 0.0000 -0.0001 -0.0003
hfenergy: -309.0689809 hartree
pointgroup: C01 [X(C8H8)]
dipole: 0.0000006 -0.0068675 -0.0000003 debye
dipolederiv: -0.0659365 0.0349488 -0.0451555 0.0307543 -0.0057308 -0.1023283 -0.0518532 -0.0596867 -0.0376456 -0.0659452 0.0349353 0.0451622 0.0307375 -0.0057709 0.1023393 0.0518585 0.0596991 -0.0376004 -0.0659613 -0.0349303 0.0451291 -0.0307332 -0.0057148 -0.1023401 0.0518353 -0.0597012 -0.037645 -0.0659496 -0.0349256 -0.0451375 -0.0307296 -0.0057568 0.1023466 -0.0518452 0.0597055 -0.0376109 0.0520029 0.0900191 0.0000108 0.0126047 -0.1318435 -0.0000155 0.0000029 -0.0000121 0.0135004 0.1372693 -0.0000061 0.0000153 -0.000006 0.1090374 0.0516402 0.0000139 0.0312894 -0.0796484 0.1372654 -0.0000016 0.0000039 -0.000001 0.1090583 -0.0515967 0.0000064 -0.0312435 -0.0796704 0.0519787 -0.0900603 -0.0000111 -0.0126465 -0.1318189 -0.0000191 -0.000001 -0.0000226 0.013504 -0.0630216 -0.0343033 0.1234232 -0.0438608 0.0983091 -0.0216949 0.1222806 -0.0293507 -0.0207657 -0.0629981 -0.0342774 -0.1234352 -0.0438355 0.0982972 0.0217181 -0.1222953 0.0293758 -0.0207772 -0.0629808 0.0343443 -0.1234327 0.0439013 0.0982905 -0.021662 -0.1222896 -0.0293191 -0.0207869 -0.063005 0.034311 0.1234362 0.0438682 0.0982792 0.0216958 0.1222966 0.0293522 -0.0207516 -0.0010749 -0.0837786 -0.0000164 -0.072235 -0.0706357 -0.00003 -0.000015 -0.0000315 0.152161 0.0696974 -0.0000131 -0.0000129 -0.0000128 -0.0916352 -0.1284322 -0.0000114 -0.107746 0.0307584 0.0696969 -0.000024 0.0000168 -0.0000245 -0.091693 0.1284034 0.0000139 0.1077151 0.0308177 -0.0010377 0.0837618 0.0000036 0.0722188 -0.0706722 -0.0000244 0.0000025 -0.0000236 0.1521606 unknown
polarizability: 72.6959921|-0.0007636|66.1220993|0.0002868|0.0000183|65.9177365 unknown
InChI: InChI=1S/C8H8/c1-2-5(1)6-3-4(6)8(2)7(1)3/h1-8H
charge 0 multiplicity 1
16 atoms
C  -1.285044 0.155101 0.779717
C  -1.284971 0.155284 -0.77974
C  1.284976 0.154795 0.779839
C  1.285053 0.154992 -0.77962
C  -0.766249 -1.074307 -0.000132
C  0.000071 1.053333 0.796958
C  0.000144 1.053525 -0.796648
C  0.765971 -1.074486 -0.000071
H  -2.113775 0.139569 1.49052
H  -2.113634 0.139915 -1.490626
H  2.113639 0.139065 1.490716
H  2.113784 0.139443 -1.490421
H  -1.333773 -2.007111 -0.000268
H  0.000153 1.991087 1.365438
H  0.000279 1.991418 -1.364898
H  1.333276 -2.007423 -0.000163
