program: Gaussian 09
title: 000140723
version: EM64L-G09RevD.01
frameworkgroup: C1[X(C11H13FO2)]
method: RPBEPBE
basis: SDD
operation: Freq
keyword: #p
keyword: freq=noraman
keyword: PBEPBE/SDD
title: #p freq=noraman PBEPBE/SDD
converged: YES YES NO NO
title: Mulliken charges:
elementType: F O O C C C C C C C C C C C H H H H H H H H H H H H H
charge: -0.209579 -0.267744 -0.237756 -0.381839 -0.555879 -0.486175 0.516232 -0.396907 -0.362657 0.238477 -0.362855 -0.369197 0.311434 -0.504542 0.224880 0.243683 0.206452 0.207810 0.236766 0.248028 0.238071 0.238885 0.253015 0.253297 0.243280 0.240877 0.233943
chargesum: 0.00000
title: Mulliken charges with hydrogens summed into heavy atoms:
elementType: F O O C C C C C C C C C C C
charge: -0.209579 -0.267744 -0.237756 0.086724 -0.141617 -0.001381 0.516232 -0.158836 -0.123772 0.238477 -0.109840 -0.115900 0.311434 0.213558
polarizability: 1.66903384e+02 1.10258382e+01 1.09733149e+02 1.06341400e+01 -1.10407265e+01 8.94604667e+01
1716.lowfreq: -8.7328 -0.0009 -0.0004 0.0003 1.1342 7.6667 13.2901 19.8520 41.3291
frequency: 8.7802 17.7116 41.3254 66.8286 89.2073 95.0014 119.5890 173.5570 197.0135 245.5828 282.7418 303.4649 371.1036 399.0769 411.7485 425.5165 477.5387 535.0629 576.4742 630.4087 662.8426 712.5761 745.0821 748.8958 813.3123 817.0489 833.5623 840.1755 853.1526 939.6520 954.3582 956.8245 1006.4771 1030.8691 1043.3079 1065.0026 1099.2321 1112.4767 1123.0870 1148.1357 1154.9387 1159.4344 1196.2207 1217.2130 1247.8218 1260.2809 1286.8220 1299.4808 1327.5964 1357.6513 1384.2897 1407.2443 1422.0082 1444.1552 1452.5042 1464.1002 1470.2067 1485.8211 1496.0438 1603.2407 1613.3056 1646.3601 2973.2044 2977.6484 3003.0497 3004.8283 3025.1298 3051.3772 3075.9079 3106.7123 3129.5960 3132.3434 3149.7281 3172.3712 3175.0254
redmass: 4.2721 5.4834 6.4652 3.1449 2.0613 1.0766 4.3380 5.0972 3.9538 4.1711 4.3708 3.6023 5.2034 3.8741 2.9617 4.2720 4.4579 2.8625 3.3166 6.9077 4.6641 3.8256 2.2575 1.5543 3.6813 1.2737 2.0662 2.8787 1.7635 1.3965 5.4477 1.3651 2.8143 3.2603 1.9815 2.9040 1.5192 1.2760 1.5143 1.4420 1.4751 1.7807 1.8356 3.1634 1.3395 1.3312 1.1505 1.2374 1.5220 1.5995 6.6171 2.8819 1.1889 1.0838 1.0502 1.0505 1.0917 1.0991 2.6847 7.5256 6.5345 9.1298 1.0599 1.0653 1.0600 1.0301 1.1001 1.0965 1.1016 1.1046 1.0901 1.0899 1.1048 1.0951 1.0959
irintensity: 0.6544 0.8063 0.1118 0.2966 0.2147 0.1640 1.1316 3.5130 7.5947 2.7335 15.1825 3.7947 6.9539 2.3029 0.0712 4.4346 13.1726 15.1868 11.2327 0.0376 5.4403 1.3807 16.5086 8.5535 36.7577 0.6465 42.7526 11.0352 7.7922 0.1950 17.7540 0.1565 8.1861 29.4700 1.0848 4.2740 51.1846 2.4300 109.0809 8.9266 64.4402 102.9932 41.4868 7.9974 32.8883 36.5017 1.5542 2.1722 34.0410 20.2252 0.0459 0.7970 21.9175 15.9547 14.3854 12.9980 1.2454 18.3226 109.7736 4.7784 11.3171 156.5545 26.2712 10.6346 30.2129 33.8894 10.2859 1.5267 36.0114 27.4521 13.1061 12.5033 16.9919 5.7930 2.3356
temp: 298.150 k
press: 1.00000 atm
elementType: 9 8 8 6 6 6 6 6 6 6 6 6 6 6 1 1 1 1 1 1 1 1 1 1 1 1 1
symmnumber: 1
zpe: 564323.2 jmol-1
zpe.correction: 0.214939 hartree
zpe.thermalcorrener: 0.229297 hartree
zpe.thermalcorrenthalpy: 0.230242 hartree
zpe.thermalcorrgfe: 0.169423 hartree
zpe.sumelectzpe: -676.214824 hartree
zpe.sumelectthermal: -676.200465 hartree
zpe.sumelectthermalent: -676.199521 hartree
zpe.sumelectthermalfe: -676.260340 hartree
dipole: 3.0672 2.0099 0.9235
dipole: 3.7816
quadrupole: -84.3995 -82.8758 -79.6461
quadrupole: 0.1062 -2.7649 -5.3198
quadrupole: -2.0924 -0.5687 2.6610 0.1062 -2.7649 -5.3198
hfenergy: -676.4297629 hartree
pointgroup: C01 [X(C11H13F1O2)]
dipole: -1.201283 -0.7824039 -0.3978956 debye
polarizability: 166.5162542|16.3376703|86.6130789|1.6208781|6.4848487|112.9676659 unknown
InChI: InChI=1S/C11H13FO2/c1-14-11(13)4-2-3-9-5-7-10(12)8-6-9/h5-8H,2-4H2,1H3
charge 0 multiplicity 1
27 atoms
F  5.232903 1.113412 0.07539
O  -4.800896 -0.214496 -0.383905
O  -3.518292 1.109828 1.038978
C  -1.099644 -0.229284 0.014725
C  0.018702 -1.291451 -0.161365
C  -2.506205 -0.858119 -0.078459
C  1.412637 -0.682818 -0.101434
C  2.146019 -0.417101 -1.286245
C  1.994661 -0.331668 1.145353
C  -3.610299 0.127586 0.268087
C  3.424463 0.184307 -1.241388
C  3.270221 0.269308 1.218052
C  3.955745 0.514559 0.015882
C  -5.968558 0.650984 -0.08191
H  -0.98776 0.555782 -0.757212
H  -0.990047 0.278014 0.990616
H  -0.094966 -2.058245 0.63136
H  -0.123458 -1.811045 -1.12904
H  -2.584909 -1.703854 0.636358
H  -2.702959 -1.279269 -1.080265
H  1.715611 -0.684677 -2.258416
H  1.446413 -0.533463 2.073295
H  3.997475 0.390799 -2.150018
H  3.727188 0.540151 2.174301
H  -5.752902 1.694834 -0.364929
H  -6.205598 0.610752 0.994587
H  -6.788144 0.236174 -0.684902
