program: Gaussian 09
title: 000011396
version: EM64L-G09RevD.01
frameworkgroup: C1[X(C12H12)]
method: RPBEPBE
basis: SDD
operation: Freq
keyword: #p
keyword: freq=noraman
keyword: PBEPBE/SDD
title: #p freq=noraman PBEPBE/SDD
converged: YES YES NO YES
title: Mulliken charges:
elementType: C C C C C C C C C C C C H H H H H H H H H H H H
charge: 0.373407 0.395946 -0.624229 -0.624229 0.456687 0.456688 -0.417956 -0.417955 -0.369820 -0.369820 -0.813556 -0.813556 0.238844 0.238844 0.233749 0.233749 0.228549 0.228549 0.228926 0.225174 0.228954 0.228972 0.228908 0.225174
chargesum: 0.00000
title: Mulliken charges with hydrogens summed into heavy atoms:
elementType: C C C C C C C C C C C C
charge: 0.373407 0.395946 -0.385385 -0.385385 0.456687 0.456688 -0.184206 -0.184206 -0.141271 -0.141271 -0.130502 -0.130502
polarizability: 2.08476191e+02 1.58363318e-05 1.30768019e+02 -3.34855072e-03 -4.03288984e-04 6.06098702e+01
1716.lowfreq: -6.3838 -0.0003 0.0000 0.0003 9.0494 9.7908 85.5814 91.4978 117.2118
frequency: 85.5791 91.4925 117.2117 129.0751 213.1883 277.2587 281.2648 320.6467 410.2387 414.3272 435.8912 460.7871 480.5832 547.9342 632.9507 643.6027 676.4458 763.8176 765.7012 787.5155 794.4460 852.3586 871.6777 927.4893 933.4356 948.8209 961.6820 978.8201 992.4219 1023.3995 1048.5761 1050.6344 1138.3960 1162.6328 1187.4962 1189.2659 1235.6990 1269.2174 1277.5171 1337.5283 1398.0136 1398.5309 1413.0648 1421.4986 1422.0291 1459.0106 1468.9039 1469.1232 1476.4534 1482.2404 1522.2944 1580.4148 1618.7342 1645.9192 2973.5435 2973.8724 3050.2467 3050.2919 3083.7760 3083.9089 3111.8616 3112.8570 3112.8794 3115.7761 3136.6914 3138.9303
redmass: 1.2355 1.0336 2.2931 3.2248 2.9930 3.6511 3.3432 2.7367 2.9341 4.6027 3.3937 5.3071 2.4572 3.4642 6.9301 2.6801 5.0594 4.8296 5.0353 2.4794 1.2931 1.5248 1.2612 1.6725 2.3125 4.1542 1.3093 1.3896 1.4379 1.5963 1.5540 1.5639 1.5749 1.2639 1.3123 2.3787 2.3939 1.9807 1.8073 1.6680 1.2694 1.2334 4.7174 2.9757 3.7574 2.7701 1.0457 1.0457 1.1538 1.2383 3.3963 6.6209 5.7882 6.7250 1.0373 1.0373 1.0974 1.0974 1.0986 1.0986 1.0869 1.0862 1.0912 1.0910 1.0981 1.0971
irintensity: 2.2638 0.0000 1.3521 0.0000 1.0938 0.8384 0.0000 1.4248 0.0000 0.6212 0.0759 0.0604 24.7089 6.9019 1.7145 0.0000 0.4556 0.1607 0.0019 2.0793 0.0000 81.7834 0.0000 10.7138 0.2114 3.6579 0.0000 5.1851 12.2399 0.1480 0.0000 26.6709 6.4641 4.7358 0.2101 3.7077 2.4067 0.6751 4.4590 0.7974 17.7262 4.8112 4.2540 1.4754 1.1265 11.0414 0.0000 25.9755 13.0724 0.2649 26.6393 0.1209 9.2293 30.8737 78.1194 10.4831 0.1096 45.0941 2.3270 34.4062 6.2773 1.6397 4.9768 42.2244 28.1538 32.7061
temp: 298.150 k
press: 1.00000 atm
elementType: 6 6 6 6 6 6 6 6 6 6 6 6 1 1 1 1 1 1 1 1 1 1 1 1
symmnumber: 1
zpe: 522994.7 jmol-1
zpe.correction: 0.199198 hartree
zpe.thermalcorrener: 0.209738 hartree
zpe.thermalcorrenthalpy: 0.210682 hartree
zpe.thermalcorrgfe: 0.163172 hartree
zpe.sumelectzpe: -463.654332 hartree
zpe.sumelectthermal: -463.643792 hartree
zpe.sumelectthermalent: -463.642848 hartree
zpe.sumelectthermalfe: -463.690358 hartree
dipole: 0.0000 -0.2292 0.0002
dipole: 0.2292
quadrupole: -59.7391 -63.4922 -76.6611
quadrupole: 0.0000 -0.0010 -0.0001
quadrupole: 6.8917 3.1386 -10.0303 0.0000 -0.0010 -0.0001
hfenergy: -463.8535301 hartree
pointgroup: C01 [X(C12H12)]
dipole: 0.0000024 -0.0901735 0.0000744 debye
dipolederiv: 0.2467738 0.0000047 -0.0017595 0.0000047 -0.0726752 -0.0000106 -0.0017022 -0.0000012 0.0587452 -0.0193551 0.0000021 0.0004291 0.0000024 -0.1724234 -0.0000145 0.0004509 -0.0000194 0.0241018 -0.2673079 0.0501624 0.0006572 -0.0444824 0.089966 0.0004547 0.0006318 -0.0004288 -0.196811 -0.2673073 -0.0501726 0.0006594 0.0444721 0.0899648 -0.0004105 0.0006637 0.0004789 -0.1968113 0.3543641 -0.1745715 -0.0036127 -0.1944196 0.0878984 0.0018198 -0.0037485 0.001684 -0.0333718 0.3543494 0.174579 -0.003634 0.1944279 0.0879101 -0.0018269 -0.0040229 -0.0017616 -0.0333691 0.056512 0.0143317 -0.0020233 0.0700588 0.1223326 -0.0005901 -0.0020091 -0.0000944 -0.1641874 0.056515 -0.014333 -0.0020167 -0.07006 0.1223304 0.0006296 -0.0019904 0.0001416 -0.1641876 -0.1179135 0.1310929 -0.0006509 0.2038705 -0.0234009 -0.0018517 -0.0006236 -0.0012057 -0.1897787 -0.1179034 -0.1310955 -0.0007022 -0.2038735 -0.023411 0.0019007 -0.0006459 0.0012741 -0.1897776 -0.1512254 0.0908605 0.0020932 0.0224566 0.0577233 -0.0002143 0.0023093 -0.0008952 0.0750145 -0.1512161 -0.0908656 0.0021126 -0.0224638 0.0577188 0.0002297 0.0027262 0.0009958 0.0750107 0.0693903 -0.0128006 0.0007314 0.0404704 -0.118929 -0.0004053 0.0007459 0.0000961 0.149775 0.069391 0.0128058 0.0007221 -0.0404651 -0.1189291 0.0003509 0.0007213 -0.0001648 0.1497755 0.0695945 0.0388683 0.0007632 -0.0268926 -0.1247772 0.0002084 0.0007479 -0.0003934 0.1527156 0.0695947 -0.0388629 0.0007529 0.026898 -0.1247777 -0.0002581 0.0007424 0.0003453 0.1527157 -0.1041777 -0.1010202 0.0023376 -0.0881342 0.0426746 0.0007973 0.0023229 0.0009081 0.1521683 -0.1041838 0.1010158 0.0023545 0.0881295 0.0426803 -0.0008243 0.002315 -0.0009279 0.1521681 -0.0491522 0.0151949 -0.0919773 0.001705 0.0686376 -0.0706602 -0.1507055 -0.0262858 -0.0443774 0.0708642 -0.0803983 0.0003732 0.0526368 -0.1483365 -0.0003566 0.0002759 0.0008664 0.1064941 -0.0446582 0.0157974 0.091975 0.0032603 0.0687608 0.0704589 0.150689 0.0258827 -0.0490649 -0.0446081 -0.0159244 0.0919491 -0.003512 0.0688776 -0.0703073 0.1506571 -0.0257545 -0.0492911 -0.0492032 -0.0150728 -0.0920019 -0.0014575 0.0685196 0.0707999 -0.1507334 0.0264017 -0.04415 0.0708629 0.0804021 0.0004682 -0.0526323 -0.1483351 0.0000806 0.0001822 -0.0011422 0.1064935 unknown
polarizability: 208.4636111|0.0012429|130.7680185|-1.3638414|0.0056097|60.622451 unknown
InChI: InChI=1S/C12H12/c1-9-3-5-11-6-4-10(2)8-12(11)7-9/h3-8H,1-2H3
charge 0 multiplicity 1
24 atoms
C  0.000016 -0.470977 -0.000224
C  -0.000004 0.976358 -0.000083
C  1.255753 -1.165289 -0.011868
C  -1.255701 -1.165327 0.011274
C  2.477021 -0.480722 -0.023029
C  -2.476988 -0.480796 0.022575
C  1.257449 1.664806 -0.011522
C  -1.257477 1.664768 0.011477
C  2.459601 0.957571 -0.022648
C  -2.459608 0.957497 0.022462
C  3.804241 -1.217856 -0.035305
C  -3.804186 -1.217971 0.034809
H  1.248519 -2.26303 -0.011938
H  -1.248436 -2.263067 0.011118
H  1.261475 2.761795 -0.011395
H  -1.261534 2.761757 0.011543
H  3.414026 1.498608 -0.031311
H  -3.414049 1.498505 0.031211
H  4.416962 -0.955358 0.848195
H  3.660941 -2.311938 -0.033391
H  4.400072 -0.956278 -0.930555
H  -4.399498 -0.957378 0.930698
H  -4.41743 -0.954528 -0.848041
H  -3.660865 -2.312047 0.031647
