program: Gaussian 09
title: 000140775
version: EM64L-G09RevD.01
frameworkgroup: C1[X(C18H30N2O4)]
method: RPBEPBE
basis: SDD
operation: Freq
keyword: #p
keyword: freq=noraman
keyword: PBEPBE/SDD
title: #p freq=noraman PBEPBE/SDD
converged: YES YES NO NO
title: Mulliken charges:
elementType: O O O O N N C C C C C C C C C C C C C C C C C C H H H H H H H H H H H H H H H H H H H H H H H H H H H H H H
charge: -0.338229 -0.338301 -0.327993 -0.328004 -0.061255 -0.061266 0.130916 0.130769 -0.091179 -0.091279 -0.407584 -0.379556 -0.407651 -0.379343 0.205657 0.205716 -0.669124 -0.655601 -0.669107 -0.655652 -0.204460 -0.204443 -0.686110 -0.686105 0.208031 0.324720 0.202272 0.298559 0.324889 0.208030 0.298483 0.202219 0.218298 0.211410 0.244913 0.219956 0.198781 0.257622 0.218295 0.211392 0.244827 0.198749 0.219980 0.257617 0.223002 0.220577 0.222769 0.220801 0.212131 0.217361 0.227016 0.212158 0.217394 0.226928
chargesum: 0.00000
title: Mulliken charges with hydrogens summed into heavy atoms:
elementType: O O O O N N C C C C C C C C C C C C C C C C C C
charge: -0.338229 -0.338301 -0.327993 -0.328004 -0.061255 -0.061266 0.130916 0.130769 -0.091179 -0.091279 0.125168 0.121276 0.125268 0.121360 0.205657 0.205716 0.005498 0.020758 0.005407 0.020695 0.239120 0.239126 -0.029603 -0.029624
polarizability: 3.24652135e+02 4.04624594e+00 2.92600008e+02 -3.56620333e-02 -7.01394995e-03 1.64613110e+02
1716.lowfreq: -4.3174 -2.7263 0.0003 0.0005 0.0006 8.0234 22.4108 24.6205 30.6357
frequency: 22.2879 24.6170 30.6015 32.9169 43.5190 51.6637 53.6034 67.2660 68.3748 77.6059 83.1630 88.0510 96.5334 105.7953 108.4487 142.3680 143.2372 172.5788 191.2524 194.5090 207.2433 208.3218 230.2674 250.2808 252.9845 257.3690 260.3693 266.9213 280.9601 297.2595 316.6120 319.3035 334.5773 337.6956 350.7329 382.5016 393.0095 400.9010 478.8843 490.0376 532.8671 571.5086 616.3026 630.2006 660.4771 665.4574 720.2723 737.4729 749.0884 768.9910 780.6487 788.3388 795.0858 798.1560 798.4346 800.7559 813.4427 847.5577 878.0510 885.3862 934.2676 940.1540 978.2909 986.5466 1015.4340 1028.8105 1031.8168 1041.3340 1058.3460 1068.9695 1069.8289 1078.9186 1081.0383 1096.5788 1099.9692 1104.5330 1108.3729 1110.0965 1136.1463 1136.1959 1187.9975 1192.4205 1196.5937 1205.3676 1241.3695 1241.4712 1297.4513 1299.6665 1305.5519 1307.8379 1336.9519 1343.6730 1350.1827 1350.9988 1372.5445 1374.9303 1383.6289 1384.1777 1387.6413 1387.7723 1395.3246 1395.8781 1403.2511 1427.1615 1458.1061 1463.1907 1464.9396 1465.0706 1467.5016 1467.9049 1470.7333 1473.4154 1476.1065 1476.4677 1478.7667 1479.2892 1481.4855 1485.3372 1488.1023 1488.9635 1501.4819 1503.3404 1558.3066 1588.5306 1616.1003 1698.6940 2982.3965 2982.6120 2987.6294 2987.7395 2988.3394 2988.4222 3000.7325 3001.0832 3005.5399 3005.6024 3021.1800 3021.5582 3059.8074 3059.8535 3073.4330 3073.4980 3077.4654 3077.5228 3084.8871 3084.9239 3088.1960 3088.4690 3097.5151 3097.5749 3102.9194 3102.9905 3108.2193 3108.3780 3114.2744 3114.4528
redmass: 3.5735 3.7178 3.4633 3.4547 3.1581 2.9987 2.8595 2.7161 3.2220 2.7974 3.4569 3.3594 2.6950 3.0950 3.0871 3.6078 3.6422 3.9498 1.1973 1.2378 1.0822 1.0567 3.5240 1.4311 4.0914 1.1984 2.0143 2.3334 4.3289 3.3458 4.4482 2.8458 3.2505 5.6905 2.7380 4.7763 3.3853 3.5102 2.5928 4.0061 3.4522 2.8072 7.5035 6.2691 11.0475 11.0177 3.6664 4.4308 10.2539 6.3520 1.7680 1.2925 1.4455 1.1017 1.0999 1.2225 1.4219 3.4897 3.8429 2.2988 2.2270 2.3594 2.4126 4.6010 4.3250 3.0545 2.6821 4.1503 4.0009 2.5948 2.5069 1.9380 2.0749 2.5544 1.9483 2.2487 2.2083 2.4161 1.4517 1.4520 2.0385 2.7029 2.3525 2.1977 1.1398 1.1398 1.2066 1.2876 1.3134 1.3319 1.4028 1.3918 1.2586 1.2398 1.2882 1.2350 1.2127 1.2075 1.2283 1.2135 1.3001 1.2707 2.5106 5.0772 1.1164 1.0595 1.0442 1.0438 1.0613 1.0434 1.0739 1.0682 1.0553 1.0518 1.0505 1.0475 1.1003 1.0872 1.0776 1.0812 1.1486 1.0866 4.4515 6.3866 10.3770 9.3246 1.0355 1.0355 1.0364 1.0364 1.0356 1.0356 1.0664 1.0663 1.0581 1.0581 1.0637 1.0638 1.1058 1.1058 1.0999 1.0999 1.0987 1.0987 1.0987 1.0986 1.0984 1.0984 1.1025 1.1025 1.0963 1.0961 1.1028 1.1028 1.1018 1.1019
irintensity: 0.0021 0.1735 2.6300 0.3003 0.5401 0.0223 0.0158 3.2744 0.5046 0.1944 0.0715 0.1430 0.6069 6.2963 0.8350 2.3162 1.2502 0.1542 0.6730 0.0853 0.3079 0.5314 10.4074 2.0353 0.2998 1.7133 5.0313 0.6109 8.4088 0.5806 0.0187 1.9388 18.1338 13.7702 0.5156 0.4313 4.0747 26.1819 3.6527 1.7283 6.4643 0.6681 10.0229 6.1338 6.8371 8.8807 1.3136 0.0609 21.3293 6.7301 131.6517 7.5853 17.2028 4.1778 1.2522 0.7131 42.5707 0.6944 155.2041 2.8159 47.0599 1.2244 13.8366 3.7867 14.3022 12.6160 180.7270 64.6386 269.4484 3.3768 0.4766 0.0044 124.0799 329.3291 4.7306 75.0211 0.6026 133.5081 7.6886 0.6429 2.7270 84.1663 0.2276 47.3614 0.0862 0.0969 61.7658 2.4962 0.1495 136.2952 5.3587 72.1295 15.6693 1.2919 0.3374 23.8695 14.0197 24.2688 29.9076 39.8554 11.6892 59.9191 4.4721 198.7901 137.0880 2.6728 1.8130 15.7808 36.9988 3.6617 38.9504 8.8727 8.8432 0.9769 21.3058 0.1530 117.0792 19.1302 11.7900 0.0115 32.2704 3.8432 984.1077 1392.4879 4.5268 46.3087 17.9785 39.7055 44.9590 15.1659 47.1238 9.7520 50.1390 57.1972 63.1617 14.0720 97.6249 16.6267 4.4985 7.9868 35.3098 38.9263 21.3251 33.6045 62.9495 20.1640 65.4058 12.4514 18.8109 81.9987 47.5747 16.5732 7.1055 7.8888 3.5361 0.5239
temp: 298.150 k
press: 1.00000 atm
elementType: 8 8 8 8 7 7 6 6 6 6 6 6 6 6 6 6 6 6 6 6 6 6 6 6 1 1 1 1 1 1 1 1 1 1 1 1 1 1 1 1 1 1 1 1 1 1 1 1 1 1 1 1 1 1
symmnumber: 1
zpe: 1199062.9 jmol-1
zpe.correction: 0.456699 hartree
zpe.thermalcorrener: 0.485935 hartree
zpe.thermalcorrenthalpy: 0.486880 hartree
zpe.thermalcorrgfe: 0.393912 hartree
zpe.sumelectzpe: -1112.381340 hartree
zpe.sumelectthermal: -1112.352104 hartree
zpe.sumelectthermalent: -1112.351159 hartree
zpe.sumelectthermalfe: -1112.444127 hartree
dipole: 0.0006 -0.0006 1.4635
dipole: 1.4635
quadrupole: -124.2623 -144.4438 -143.5591
quadrupole: -14.3481 -0.0060 0.0154
quadrupole: 13.1594 -7.0220 -6.1373 -14.3481 -0.0060 0.0154
hfenergy: -1112.838039 hartree
pointgroup: C01 [X(C18H30N2O4)]
dipole: -0.000136 0.0008272 -0.5757982 debye
polarizability: 324.9065367|-2.855246|292.3454684|-0.063891|0.1251566|164.6132476 unknown
InChI: InChI=1S/C18H30N2O4/c1-7-19(8-2)15-13(17(21)23-11-5)16(20(9-3)10-4)14(15)18(22)24-12-6/h7-12H2,1-6H3
charge 0 multiplicity 1
54 atoms
O  -3.219231 0.492093 0.785072
O  3.218271 -0.49741 0.781781
O  -2.175626 2.561797 0.537887
O  2.173738 -2.566329 0.531975
N  -1.169937 -2.032531 -0.257193
N  1.168108 2.030123 -0.253004
C  -0.515615 -0.886193 -0.008642
C  0.514133 0.883003 -0.006975
C  -0.927429 0.532406 0.071112
C  0.926112 -0.535827 0.068875
C  -2.634731 -2.068687 -0.543032
C  -0.482431 -3.345268 -0.446085
C  2.632913 2.06752 -0.538275
C  0.480095 3.342975 -0.4391
C  -2.082749 1.291851 0.438982
C  2.08128 -1.296218 0.435173
C  -2.929714 -1.774621 -2.029252
C  -0.597855 -4.246508 0.798123
C  2.9286 1.780922 -2.025726
C  0.594536 4.241635 0.807094
C  -4.412849 1.260607 1.226604
C  4.412127 -1.266801 1.221049
C  -5.50799 0.240822 1.53507
C  5.510526 -0.248089 1.521638
H  -2.991501 -3.077766 -0.269869
H  -3.139328 -1.328417 0.09314
H  -0.952867 -3.827728 -1.324268
H  0.583016 -3.170702 -0.650544
H  3.137238 1.323958 0.094281
H  2.989753 3.075158 -0.259801
H  -0.585254 3.168537 -0.644201
H  0.95071 3.827577 -1.31597
H  -4.016251 -1.853466 -2.215926
H  -2.414776 -2.484307 -2.702701
H  -2.610858 -0.750398 -2.289821
H  -0.1511 -5.233006 0.578906
H  -1.647518 -4.404138 1.108095
H  -0.034744 -3.799513 1.633466
H  4.015293 1.860535 -2.211256
H  2.414327 2.494046 -2.696038
H  2.609848 0.758039 -2.291699
H  1.643962 4.400068 1.1175
H  0.146445 5.228006 0.590035
H  0.032006 3.792121 1.641489
H  -4.139748 1.859461 2.114393
H  -4.706855 1.962625 0.425022
H  4.141458 -1.86174 2.112266
H  4.701349 -1.972328 0.420899
H  -6.416918 0.762772 1.886863
H  -5.773438 -0.343521 0.636046
H  -5.183956 -0.459502 2.324629
H  6.419689 -0.770517 1.872087
H  5.77375 0.332244 0.619373
H  5.190786 0.45583 2.309754
