program: Gaussian 09
title: 000140692
version: EM64L-G09RevD.01
frameworkgroup: C1[X(C10H8)]
method: RPBEPBE
basis: SDD
operation: Freq
keyword: #p
keyword: freq=noraman
keyword: PBEPBE/SDD
title: #p freq=noraman PBEPBE/SDD
converged: NO NO NO NO
title: Mulliken charges:
elementType: C C C C C C C C C C H H H H H H H H
charge: 0.333391 0.333390 -0.393476 -0.393476 -0.428899 -0.428901 -0.154067 -0.154066 -0.204301 -0.204302 0.261917 0.261917 0.222347 0.222348 0.183100 0.183099 0.179990 0.179991
chargesum: 0.00000
title: Mulliken charges with hydrogens summed into heavy atoms:
elementType: C C C C C C C C C C
charge: 0.333391 0.333390 -0.131560 -0.131560 -0.206552 -0.206553 0.029033 0.029033 -0.024311 -0.024312
polarizability: 1.80384963e+02 2.35585881e-05 1.32224977e+02 -1.73813254e-03 -6.56085251e-04 4.30868791e+01
1716.lowfreq: -7.8420 -0.0010 -0.0009 -0.0007 7.3290 13.1347 114.8302 165.7998 276.4237
frequency: 114.8048 165.7994 276.4237 278.6060 306.3345 329.2023 467.8748 477.0957 605.7122 626.7833 700.5518 710.8018 718.3257 733.2852 804.6092 805.9374 823.1698 861.6027 891.3909 912.8256 931.5364 964.5344 982.3220 1001.4888 1005.1801 1090.7906 1101.1858 1219.5445 1270.1858 1301.2291 1326.6819 1366.6318 1369.4096 1389.6491 1437.9362 1480.7737 1554.0293 1587.8121 1661.4136 1690.4902 3057.8235 3071.5216 3081.3890 3090.8782 3105.1923 3114.1574 3185.3454 3214.3455
redmass: 3.2248 3.8423 5.6105 3.1479 7.2447 2.8214 2.7200 4.1000 3.0851 5.2554 1.1612 5.8124 3.6000 5.9268 1.2833 1.2941 3.6778 1.5444 5.2909 1.3860 1.4414 1.6851 1.3458 1.3084 2.8463 2.4716 1.8440 2.0021 1.8070 2.8778 1.1521 1.7448 1.2092 1.3583 1.3781 1.7332 9.8864 4.5729 7.8863 8.5811 1.0802 1.0832 1.0866 1.0887 1.0920 1.0927 1.0910 1.1124
irintensity: 0.0000 1.7602 0.4845 23.0489 0.3523 0.0000 0.0124 3.3981 0.0001 0.0053 74.2346 2.1391 0.0000 1.0649 0.0000 79.2146 4.1035 0.0000 1.0756 37.7852 0.0001 18.2043 0.7607 0.0000 0.3447 2.0325 1.9490 1.0680 4.6908 2.2334 0.3512 1.5381 0.7254 2.4380 2.6494 2.3169 0.5834 0.1609 1.0763 2.6572 0.3750 0.0830 0.1921 41.6653 89.0727 41.8331 2.0798 4.2874
temp: 298.150 k
press: 1.00000 atm
elementType: 6 6 6 6 6 6 6 6 6 6 1 1 1 1 1 1 1 1
symmnumber: 1
zpe: 372425.1 jmol-1
zpe.correction: 0.141849 hartree
zpe.thermalcorrener: 0.149666 hartree
zpe.thermalcorrenthalpy: 0.150610 hartree
zpe.thermalcorrgfe: 0.109482 hartree
zpe.sumelectzpe: -385.063262 hartree
zpe.sumelectthermal: -385.055445 hartree
zpe.sumelectthermalent: -385.054501 hartree
zpe.sumelectthermalfe: -385.095629 hartree
dipole: 0.6994 0.0000 0.0007
dipole: 0.6994
quadrupole: -48.6657 -49.5346 -64.8408
quadrupole: 0.0000 0.0109 -0.0004
quadrupole: 5.6813 4.8124 -10.4938 0.0000 0.0109 -0.0004
hfenergy: -385.2051109 hartree
pointgroup: C01 [X(C10H8)]
dipole: 0.2749793 0.0000034 -0.0101293 debye
dipolederiv: -0.0733389 0.0295748 0.003407 0.0832592 -0.0528085 -0.0031019 0.003429 -0.0008898 0.0209131 -0.0733314 -0.0295766 0.0034106 -0.0832596 -0.05281 0.0030689 0.0035392 0.0008789 0.0209093 -0.0510558 -0.0763258 -0.0053005 0.0788605 0.0593031 -0.0032861 -0.0050462 0.0024879 -0.1942103 -0.0510617 0.0763243 -0.0052949 -0.0788655 0.0593007 0.003293 -0.0050715 -0.0024507 -0.1942107 0.0397734 -0.1185207 -0.007807 -0.2061934 0.0845753 0.0076347 -0.0076487 0.0044831 -0.1672338 0.0397674 0.1185199 -0.0077975 0.2061938 0.0845815 -0.0075997 -0.0075806 -0.0044925 -0.1672371 0.1032752 0.0381074 -0.0095971 0.1381695 0.0777394 -0.0057193 -0.0103689 -0.0018362 -0.1480264 0.1032817 -0.0381064 -0.00958 -0.1381692 0.0777361 0.0056968 -0.010361 0.001835 -0.148027 0.0772514 0.1090795 -0.0078432 0.096338 0.0155226 -0.0034803 -0.0074767 -0.0036428 -0.1448295 0.0772541 -0.1090779 -0.0078498 -0.0963361 0.0155168 0.0034947 -0.0074774 0.0036607 -0.1448301 0.021485 0.0684535 0.0066252 0.1065221 0.0332933 -0.0039451 0.0064267 -0.0024494 0.1973916 0.0214871 -0.068454 0.0066384 -0.106521 0.0332902 0.00396 0.0063484 0.0024247 0.1973946 0.0264005 0.070302 0.0050836 0.0561647 -0.1023768 -0.0019866 0.0052764 -0.0023847 0.1590067 0.0264028 -0.0702988 0.0050765 -0.056162 -0.1023789 0.0019764 0.0052695 0.0023944 0.1590073 0.0147279 -0.0851852 0.0047464 -0.098859 -0.1314709 0.004136 0.0045584 0.0031987 0.1390632 0.014723 0.0851882 0.0047434 0.0988623 -0.1314674 -0.0041396 0.0045438 -0.0032099 0.1390638 -0.1585197 -0.0809774 0.0106698 -0.0727432 0.0162251 0.0028162 0.0108184 0.0031077 0.1379275 -0.1585219 0.0809732 0.010669 0.072739 0.0162284 -0.002818 0.0108214 -0.0031151 0.1379277 unknown
polarizability: 180.1892078|0.0006231|132.2249768|-5.1805933|0.0010126|43.2826347 unknown
InChI: InChI=1S/C10H8/c1-2-4-6-10-8-7-9(10)5-3-1/h1-8H
charge 0 multiplicity 1
18 atoms
C  1.042847 -0.786573 -0.042425
C  1.042833 0.786599 -0.042349
C  2.484541 -0.717296 -0.097302
C  2.484524 0.717352 -0.097398
C  0.12201 -1.80818 -0.00668
C  0.121978 1.808186 -0.006557
C  -1.315455 -1.752582 0.048519
C  -1.315488 1.752556 0.048597
C  -2.262988 -0.721671 0.081286
C  -2.263002 0.721625 0.08131
H  3.269109 -1.474916 -0.126435
H  3.269072 1.474989 -0.126608
H  0.545626 -2.823436 -0.022307
H  0.545573 2.823451 -0.022164
H  -1.774866 -2.752308 0.067426
H  -1.774921 2.752272 0.067503
H  -3.291036 -1.114191 0.118081
H  -3.291057 1.114123 0.118104
