program: Gaussian 09
title: 000140686
version: EM64L-G09RevD.01
frameworkgroup: C1[X(C13H25NO)]
method: RPBEPBE
basis: SDD
operation: Freq
keyword: #p
keyword: freq=noraman
keyword: PBEPBE/SDD
title: #p freq=noraman PBEPBE/SDD
converged: NO YES NO NO
title: Mulliken charges:
elementType: O N C C C C C C C C C C C C C H H H H H H H H H H H H H H H H H H H H H H H H H
charge: -0.464683 -0.138713 -0.137693 -0.073699 0.275207 -0.529188 -0.477809 0.044491 -0.500585 -0.406848 -0.381691 -0.431391 -0.776624 -0.676018 -0.716533 0.233121 0.240930 0.211019 0.190786 0.199142 0.227412 0.191669 0.209460 0.199804 0.189660 0.194567 0.209110 0.189408 0.184985 0.211179 0.211596 0.225035 0.221765 0.235913 0.238506 0.188225 0.321386 0.236510 0.221534 0.209056
chargesum: 0.00000
title: Mulliken charges with hydrogens summed into heavy atoms:
elementType: O N C C C C C C C C C C C C C
charge: -0.143296 -0.138713 0.095428 0.167231 0.275207 -0.127383 -0.051255 0.236160 -0.091321 -0.022622 0.016826 -0.035227 -0.118227 -0.013374 -0.049433
polarizability: 1.56870672e+02 4.23943024e-01 1.53551758e+02 2.28432820e+00 1.09614629e+00 1.24421718e+02
1716.lowfreq: -0.0006 -0.0004 0.0004 3.6196 9.6352 37.7952 71.4079 102.0034 117.5451
frequency: 71.1804 101.9694 117.3579 130.8640 149.9423 198.1460 201.2417 221.8742 225.1694 237.3934 267.9011 279.9448 299.7899 304.7203 326.9854 334.9644 359.3176 386.3544 429.7154 439.0828 458.4685 473.5426 502.3127 507.3926 556.5828 580.2381 649.0752 744.5161 762.9051 773.0847 804.6702 824.7107 861.5374 871.9130 897.9925 909.6480 921.5720 939.5718 956.9100 973.7713 1003.3926 1040.2858 1048.9198 1050.2545 1062.3933 1072.9482 1082.1784 1090.8271 1102.2896 1108.1841 1121.5685 1125.2389 1146.9865 1159.9819 1167.1526 1195.7579 1213.5055 1228.8405 1245.0564 1253.6080 1259.7702 1285.5257 1300.9172 1309.7338 1312.5213 1322.6478 1338.2483 1339.3283 1345.9783 1346.7214 1356.7832 1361.6151 1368.6421 1379.5298 1381.2000 1386.6494 1433.3331 1442.1461 1451.8603 1461.8720 1463.8757 1466.8977 1471.7883 1474.2589 1476.0792 1480.6311 1485.9050 1491.7800 1509.9506 2835.6535 2851.6340 2884.3231 2953.0915 2958.4883 2965.1139 2976.6852 2979.6547 2979.9434 2983.8564 2984.2779 2987.1368 3016.7519 3023.3800 3030.3154 3036.3751 3042.1563 3049.9624 3056.5218 3072.9461 3074.8148 3083.4004 3087.9696 3104.9925 3539.1837
redmass: 2.9707 2.6888 2.8740 2.7321 2.9242 1.9573 1.2115 1.6386 1.2600 1.8331 2.5437 1.6501 1.3138 3.4631 2.5423 2.5030 2.5898 2.4839 3.3639 1.8610 2.1841 2.5221 2.8166 2.6330 2.2772 3.1075 2.7741 2.6655 2.4856 1.4085 2.1637 2.1148 2.2135 2.0566 1.9497 1.8440 2.1372 1.7956 1.7709 2.0379 2.0792 1.7548 1.6515 1.7554 1.8522 2.1720 2.3353 1.5373 1.3739 1.7302 1.8715 1.6058 2.1066 2.2850 1.8229 2.0721 1.9378 1.5105 1.2843 1.3710 1.3080 1.2863 1.3500 1.5538 1.3182 1.4855 1.3684 1.4989 1.4503 1.5465 1.5659 1.4915 1.5523 1.2625 1.4834 1.2251 1.1730 1.0952 1.0881 1.0815 1.0700 1.0724 1.0748 1.0755 1.0458 1.0526 1.0591 1.0601 1.0550 1.0789 1.0612 1.0805 1.0654 1.0626 1.0618 1.0680 1.0382 1.0623 1.0592 1.0430 1.0724 1.0943 1.0961 1.0969 1.0975 1.0999 1.1021 1.0707 1.0985 1.0994 1.0994 1.0998 1.0988 1.0657
irintensity: 0.7856 0.1263 0.7506 0.1259 0.8423 1.7917 0.2567 1.6921 0.2717 2.1699 6.4517 24.9077 106.1028 4.1336 2.4175 1.3830 2.8737 1.4493 8.5734 2.8003 1.2228 0.9090 3.4654 1.9842 2.3778 3.0091 2.3965 6.9175 2.5534 3.5728 10.5339 2.4698 8.2473 19.2831 5.5971 5.1891 6.8212 19.5221 12.9315 25.1263 4.7244 5.1178 1.8873 24.2213 4.4140 1.9178 13.8872 4.0494 13.0749 6.6741 14.5160 23.7936 4.4715 3.2620 4.5873 18.1085 15.3910 5.3853 1.8806 11.5994 1.7689 2.5495 6.3338 2.5637 12.3992 12.5504 0.3657 13.5009 1.1872 7.8112 10.8026 2.9437 11.7835 27.3188 0.2995 16.8531 3.6804 6.2217 9.8640 1.8288 24.0583 1.1056 11.4167 5.2250 12.8864 4.2948 18.2475 10.9961 14.1727 41.6905 136.4405 62.9770 19.5314 37.4607 55.2583 18.5615 48.2712 37.3235 43.7623 12.9651 49.2475 4.4152 68.6599 43.3781 57.1384 11.6740 93.1188 45.4589 39.0890 59.1194 37.5814 29.5650 29.1581 2.8872
temp: 298.150 k
press: 1.00000 atm
elementType: 8 7 6 6 6 6 6 6 6 6 6 6 6 6 6 1 1 1 1 1 1 1 1 1 1 1 1 1 1 1 1 1 1 1 1 1 1 1 1 1
symmnumber: 1
zpe: 948869.1 jmol-1
zpe.correction: 0.361405 hartree
zpe.thermalcorrener: 0.377155 hartree
zpe.thermalcorrenthalpy: 0.378099 hartree
zpe.thermalcorrgfe: 0.320828 hartree
zpe.sumelectzpe: -639.114302 hartree
zpe.sumelectthermal: -639.098552 hartree
zpe.sumelectthermalent: -639.097608 hartree
zpe.sumelectthermalfe: -639.154879 hartree
dipole: -0.3948 -1.1450 -0.6255
dipole: 1.3631
quadrupole: -91.6121 -89.7870 -98.2250
quadrupole: 2.4333 2.3801 -0.0148
quadrupole: 1.5959 3.4210 -5.0169 2.4333 2.3801 -0.0148
hfenergy: -639.4757071 hartree
pointgroup: C01 [X(C13H25N1O1)]
dipole: -0.1929895 0.4341456 0.248751 debye
polarizability: 156.9275338|-0.1267302|153.4902381|-2.3037446|1.1043474|124.4263761 unknown
InChI: InChI=1S/C13H25NO/c1-4-13(15)9-10(2)14(3)12-8-6-5-7-11(12)13/h10-12,15H,4-9H2,1-3H3
charge 0 multiplicity 1
40 atoms
O  -1.656702 0.985958 -1.54646
N  1.515894 0.682937 0.026801
C  -0.553874 -0.714343 -0.261197
C  0.833751 -0.327953 -0.857947
C  -1.45181 0.541608 -0.131916
C  -0.699536 1.644202 0.644183
C  -0.389132 -1.493661 1.069184
C  0.710457 1.947993 0.087183
C  1.657384 -1.625035 -1.056543
C  0.477631 -2.761634 0.880159
C  1.849734 -2.412495 0.259015
C  -2.843798 0.281729 0.504946
C  1.374327 3.023977 0.972689
C  2.912598 0.9422 -0.39245
C  -3.678104 -0.810497 -0.195449
H  -1.039339 -1.381184 -1.003388
H  0.653091 0.127725 -1.862534
H  -0.60036 1.342249 1.705082
H  -1.299901 2.577971 0.627649
H  -1.379184 -1.782442 1.470404
H  0.09807 -0.840298 1.817497
H  0.58759 2.360623 -0.949253
H  2.628705 -1.412515 -1.538913
H  1.093829 -2.255292 -1.774987
H  -0.051789 -3.473649 0.212133
H  0.613587 -3.274597 1.852183
H  2.428835 -1.79791 0.97577
H  2.43145 -3.335469 0.067971
H  -3.403765 1.24182 0.481203
H  -2.718933 0.035254 1.577479
H  0.656383 3.842929 1.162792
H  1.665539 2.588207 1.946696
H  2.267601 3.474949 0.507594
H  3.506169 0.016185 -0.3312
H  3.381687 1.668935 0.289133
H  2.993861 1.339424 -1.436879
H  -2.181733 1.827359 -1.526449
H  -3.742449 -0.611397 -1.279646
H  -3.231032 -1.812214 -0.062081
H  -4.703732 -0.845849 0.214943
