program: Gaussian 09
title: 000140663
version: EM64L-G09RevD.01
frameworkgroup: C1[X(C16H18)]
method: RPBEPBE
basis: SDD
operation: Freq
keyword: #p
keyword: freq=noraman
keyword: PBEPBE/SDD
title: #p freq=noraman PBEPBE/SDD
converged: YES YES NO NO
title: Mulliken charges:
elementType: C C C C C C C C C C C C C C C C H H H H H H H H H H H H H H H H H H
charge: 0.114510 0.114669 -0.691542 -0.691471 -0.691442 -0.691751 -0.691547 -0.691414 0.168924 0.168881 -0.192554 -0.192581 0.038308 0.038236 -0.051888 -0.051822 0.215448 0.225187 0.225144 0.225183 0.215410 0.225098 0.215448 0.225144 0.225100 0.225244 0.215510 0.225182 0.215458 0.225042 0.225180 0.215451 0.225044 0.225212
chargesum: 0.00000
title: Mulliken charges with hydrogens summed into heavy atoms:
elementType: C C C C C C C C C C C C C C C C
charge: 0.114510 0.114669 -0.025763 -0.025780 -0.025751 -0.025814 -0.025868 -0.025706 0.168924 0.168881 -0.192554 -0.192581 0.038308 0.038236 -0.051888 -0.051822
polarizability: 5.91655099e+02 2.04791656e-01 1.14210603e+02 -9.35680419e-02 3.32309712e-03 1.14189737e+02
1716.lowfreq: -14.9600 -4.5122 -2.2043 -0.0006 0.0007 0.0008 6.3695 22.2882 23.9483
frequency: -9.5034 22.2742 23.2825 59.6631 60.7854 107.7604 108.3788 173.1151 173.3182 190.0501 196.0053 197.1599 252.0651 257.0545 258.4103 262.0671 263.9746 265.6644 325.3625 335.1506 336.0169 344.6171 345.7576 406.1992 406.2740 461.4515 467.1158 467.1586 500.4493 500.5084 532.2629 532.4525 533.8890 533.9976 592.5423 722.7526 811.6928 889.8920 920.5165 920.6325 921.4999 922.0415 949.6105 951.1954 1020.6777 1021.2579 1021.5438 1022.5322 1078.5365 1193.9342 1195.2157 1195.4777 1196.0311 1225.0493 1274.7235 1371.6884 1372.2160 1372.7058 1373.1406 1397.6342 1400.2548 1441.2355 1452.6301 1452.9886 1464.4124 1464.6285 1465.3093 1466.2708 1475.1888 1475.4670 1476.0827 1476.1109 1494.7313 1497.7923 2072.0723 2196.4814 2201.6663 2263.2440 2980.4978 2980.6492 2980.7611 2980.7941 2984.1242 2984.5244 3079.5879 3079.6764 3079.7473 3080.2492 3086.5651 3086.9193 3088.7206 3089.2230 3095.0516 3095.2727 3095.3714 3095.5454
redmass: 2.7076 4.7682 4.8040 4.1275 4.1373 4.1170 4.0908 5.0684 5.0776 1.0192 3.5111 1.0192 1.1743 1.4352 1.3839 1.2393 2.5684 1.5014 3.0082 2.5486 2.5540 2.5214 2.5213 6.9678 6.9202 2.7714 7.8683 7.8776 8.9736 8.9932 6.0833 6.0691 6.3397 6.3219 3.3694 4.8552 2.8410 2.4366 1.7906 1.7887 1.7852 1.7909 1.1973 1.1972 1.3863 1.3827 1.3847 1.3893 3.1485 2.7504 2.7686 2.7684 2.7797 2.6959 3.7508 1.1789 1.1802 1.1788 1.1802 1.2431 1.1977 5.1143 1.0495 1.0491 1.0470 1.0470 1.0474 1.0470 1.0503 1.0498 1.0501 1.0501 1.0643 1.1398 11.9680 11.9936 11.9659 11.9784 1.0343 1.0344 1.0344 1.0343 1.0351 1.0351 1.1002 1.1002 1.1003 1.1004 1.0992 1.0992 1.1018 1.1018 1.1006 1.1006 1.1006 1.1006
irintensity: 0.0054 1.8206 1.8158 0.0009 0.0013 0.2266 0.2350 0.0002 0.0001 0.0003 0.0001 0.0000 0.0226 0.0770 0.0804 0.0797 0.3509 0.2324 2.6247 0.0041 0.0180 0.5073 0.5015 0.0001 0.0002 0.0007 1.0233 1.0184 0.0000 0.0002 0.8983 0.9089 0.0109 0.0066 4.0345 0.0000 66.9129 0.0006 1.9781 1.9043 1.8364 1.8298 0.0004 0.0031 0.0554 0.0155 0.0517 0.0147 117.8236 8.8144 14.4119 1.2783 6.4738 0.0027 243.2504 16.0238 16.4955 15.7374 15.5588 0.0547 1.4125 0.0027 0.0304 0.0008 0.6022 0.5319 0.9819 0.8022 16.6954 14.6711 24.2376 6.6660 23.3707 0.0009 3.9500 0.0013 0.0008 141.5781 25.1625 24.9325 25.5978 26.8354 180.2873 2.2197 7.3501 7.0284 7.6483 7.3844 203.6227 50.3132 0.8933 0.2722 40.2258 36.4599 47.7066 42.9892
temp: 298.150 k
press: 1.00000 atm
elementType: 6 6 6 6 6 6 6 6 6 6 6 6 6 6 6 6 1 1 1 1 1 1 1 1 1 1 1 1 1 1 1 1 1 1
symmnumber: 1
zpe: 729807.5 jmol-1
zpe.correction: 0.277969 hartree
zpe.thermalcorrener: 0.296964 hartree
zpe.thermalcorrenthalpy: 0.297908 hartree
zpe.thermalcorrgfe: 0.230261 hartree
zpe.sumelectzpe: -619.142257 hartree
zpe.sumelectthermal: -619.123262 hartree
zpe.sumelectthermalent: -619.122318 hartree
zpe.sumelectthermalfe: -619.189965 hartree
dipole: -0.0008 -0.0176 0.0193
dipole: 0.0261
quadrupole: -44.7676 -96.4256 -96.4318
quadrupole: -0.0660 0.0229 0.0006
quadrupole: 34.4408 -17.2173 -17.2235 -0.0660 0.0229 0.0006
hfenergy: -619.420226 hartree
pointgroup: C01 [X(C16H18)]
dipole: 0.0002847 0.0095745 -0.0037295 debye
polarizability: 591.6480125|1.549307|114.1951864|-1.0166751|-0.0078015|114.2122401 unknown
InChI: InChI=1S/C16H18/c1-15(2,3)13-11-9-7-8-10-12-14-16(4,5)6/h1-6H3
charge 0 multiplicity 1
34 atoms
C  6.014474 0.018031 -0.011969
C  -6.014791 -0.016855 0.009448
C  6.532073 -0.337335 1.416499
C  6.534623 -1.037088 -1.036687
C  6.521658 1.436906 -0.416227
C  -6.523792 0.222955 -1.445891
C  -6.537807 -1.391271 0.52997
C  -6.526896 1.125982 0.939794
C  4.535594 0.010411 -0.010426
C  -4.535777 -0.022859 0.013223
C  3.288983 0.004324 -0.007948
C  -3.289148 -0.023144 0.013153
C  1.930571 -0.003858 -0.003249
C  -1.930701 -0.020177 0.010014
C  0.674693 -0.010709 0.001187
C  -0.67481 -0.015702 0.006152
H  7.637862 -0.333805 1.420394
H  6.184181 -1.338786 1.72497
H  6.1770 0.397967 2.159655
H  6.186625 -2.050655 -0.771041
H  7.640471 -1.035129 -1.039292
H  6.181434 -0.804679 -2.056634
H  7.627422 1.447468 -0.418162
H  6.165253 2.201419 0.296146
H  6.167074 1.70998 -1.425555
H  -6.164973 1.191669 -1.835745
H  -7.629568 0.229651 -1.455095
H  -6.17301 -0.575354 -2.123188
H  -7.643599 -1.390338 0.526934
H  -6.190136 -1.581105 1.560559
H  -6.18624 -2.217245 -0.112833
H  -7.632667 1.1377 0.936572
H  -6.181286 0.975117 1.977445
H  -6.16509 2.109614 0.592527
