program: Gaussian 09
title: 000140636
version: EM64L-G09RevD.01
frameworkgroup: C1[X(C11H18O)]
method: RPBEPBE
basis: SDD
operation: Freq
keyword: #pfreq=noraman
keyword: PBEPBE/SDD
title: #p freq=noraman PBEPBE/SDD
converged: NO YES NO NO
title: Mulliken charges:
elementType: O C C C C C C C C C C C H H H H H H H H H H H H H H H H H H
charge: -0.212520 0.098941 0.096788 0.168681 0.168221 -0.063998 -0.699357 -0.703052 -0.703041 -0.699163 -0.702685 -0.702691 0.208303 0.215540 0.208313 0.216640 0.238646 0.217026 0.238632 0.216641 0.217033 0.208312 0.215608 0.208307 0.216574 0.238851 0.217008 0.238868 0.216574 0.216998
chargesum: 0.00000
title: Mulliken charges with hydrogens summed into heavy atoms:
elementType: O C C C C C C C C C C C
charge: -0.212520 0.098941 0.096788 0.168681 0.168221 -0.063998 -0.067201 -0.030739 -0.030735 -0.066936 -0.030252 -0.030251
polarizability: 1.40914203e+02 -5.20337387e-02 1.22573450e+02 3.79421194e-04 -1.17976586e-03 9.74485368e+01
1716.lowfreq: -6.6593 -0.0009 -0.0003 0.0004 11.1464 11.5363 25.6471 26.2378 96.7961
frequency: 25.0935 25.9996 96.7957 118.8426 132.3377 163.3904 190.5401 208.8446 235.9121 245.5177 251.4048 262.5396 263.2274 283.0476 326.7441 329.3105 351.3684 356.4889 417.3097 417.9956 420.7854 575.1091 635.0501 651.4254 668.6628 700.1997 819.5335 840.1975 922.6733 924.2595 931.3111 932.5851 944.7014 948.1967 949.7644 1016.8259 1017.7286 1018.6354 1037.6732 1105.9217 1196.3389 1197.5264 1205.4810 1216.7566 1236.9565 1295.6495 1372.5148 1373.3646 1375.3490 1378.7835 1403.0130 1403.4113 1454.6877 1456.0212 1457.1133 1466.6542 1467.6430 1470.9927 1476.2761 1476.9755 1478.3020 1486.4216 1494.2377 1494.6271 1611.5625 1843.2361 2978.1140 2978.4399 2978.7178 2979.5073 2981.9075 2983.8476 3073.3834 3074.9298 3075.3852 3076.6609 3080.3117 3081.1548 3082.6776 3083.6369 3088.4516 3089.6323 3091.5049 3092.3574
redmass: 3.4677 2.7774 4.0970 3.2475 4.6026 2.6639 1.0136 1.0171 2.5558 2.3189 1.0764 1.1433 1.1338 1.0251 2.6716 2.6436 2.2483 2.3090 2.8838 3.6749 2.6605 2.9545 6.0823 8.7566 5.7962 6.3469 2.6745 2.5523 1.7576 1.7997 1.6605 1.6154 5.3540 1.2070 1.2020 1.5244 1.3987 1.3870 1.5225 2.8196 2.8375 2.7906 2.4711 2.9754 3.0354 4.0424 1.1805 1.1803 1.2023 1.1902 1.2118 1.2113 1.0490 1.0472 1.0488 1.0474 1.0477 1.0465 1.0523 1.0504 1.0538 1.0492 1.0706 1.0723 9.4021 12.3321 1.0347 1.0344 1.0344 1.0347 1.0354 1.0354 1.1005 1.1007 1.1006 1.0996 1.1003 1.0993 1.0987 1.1007 1.1006 1.1003 1.1002 1.1001
irintensity: 2.2717 0.0156 0.7985 0.5098 1.8684 0.0000 0.0000 0.0355 0.5655 0.0273 0.0000 0.0074 0.0065 0.0282 0.0840 0.7777 0.0000 0.1096 0.0373 0.0172 0.6912 0.0046 0.0017 3.2345 4.5915 1.8836 0.8707 19.8355 0.2199 4.2314 0.1558 3.0577 0.4288 0.0000 0.0467 9.5430 0.0001 0.0003 0.4371 34.8285 2.8421 12.3865 2.0511 11.8001 29.0775 8.4509 1.9929 35.0077 5.2408 31.5748 7.2955 4.0279 0.0006 7.0038 1.3459 0.0066 2.3375 3.1886 12.3646 0.0010 20.0688 32.4319 35.7524 4.2612 162.5837 302.4509 16.2250 17.0422 40.8810 23.4494 34.1762 30.5057 18.0441 1.3819 13.9627 0.8030 0.1449 160.3626 5.0636 31.5970 6.3879 52.1939 23.2496 54.6602
temp: 298.150 k
press: 1.00000 atm
elementType: 8 6 6 6 6 6 6 6 6 6 6 6 1 1 1 1 1 1 1 1 1 1 1 1 1 1 1 1 1 1
symmnumber: 1
zpe: 678429.0 jmol-1
zpe.correction: 0.258400 hartree
zpe.thermalcorrener: 0.273616 hartree
zpe.thermalcorrenthalpy: 0.274560 hartree
zpe.thermalcorrgfe: 0.216287 hartree
zpe.sumelectzpe: -504.170895 hartree
zpe.sumelectthermal: -504.155678 hartree
zpe.sumelectthermalent: -504.154734 hartree
zpe.sumelectthermalfe: -504.213008 hartree
dipole: -0.0006 -4.8719 0.0001
dipole: 4.8719
quadrupole: -66.1720 -90.0968 -73.4491
quadrupole: -0.0093 0.0000 -0.0002
quadrupole: 10.4006 -13.5242 3.1235 -0.0093 0.0000 -0.0002
hfenergy: -504.4292945 hartree
pointgroup: C01 [X(C11H18O1)]
dipole: 0.016976 1.9166625 0.0005787 debye
polarizability: 140.9136566|-0.1128087|122.573994|0.0005346|0.0070148|97.4485387 unknown
InChI: InChI=1S/C11H18O/c1-10(2,3)7-8(9(7)12)11(4,5)6/h1-6H3
charge 0 multiplicity 1
30 atoms
O  -0.014027 -2.833053 -0.000904
C  -0.690378 -0.283704 -0.00016
C  0.706178 -0.294529 -0.000182
C  -1.992066 0.476367 0.00014
C  2.020974 0.440672 0.000218
C  -0.005393 -1.579333 -0.000538
C  -1.775952 2.00981 0.001238
C  -2.787025 0.044903 1.270315
C  -2.786552 0.046688 -1.270948
C  1.836211 1.978261 0.001496
C  2.807448 -0.005028 -1.270948
C  2.807837 -0.007127 1.270392
H  -1.216185 2.336722 -0.893517
H  -2.752049 2.528865 0.001429
H  -1.216481 2.335486 0.896627
H  -2.257323 0.342842 2.193157
H  -2.933374 -1.049241 1.293393
H  -3.780456 0.53046 1.269698
H  -2.933049 -1.047404 -1.295537
H  -2.256431 0.345785 -2.193174
H  -3.779914 0.532384 -1.27008
H  1.283179 2.314742 0.896832
H  2.822382 2.477876 0.001802
H  1.282998 2.316206 -0.893176
H  2.283944 0.305449 -2.193158
H  2.930738 -1.101888 -1.295483
H  3.81062 0.460053 -1.269184
H  2.930971 -1.104042 1.29316
H  2.284698 0.301966 2.193273
H  3.811076 0.457813 1.269019
