program: Gaussian 09
title: 000140626
version: EM64L-G09RevD.01
frameworkgroup: C1[X(C16H10O4)]
method: RPBEPBE
basis: SDD
operation: Freq
keyword: #pfreq=noraman
keyword: PBEPBE/SDD
title: #p freq=noraman PBEPBE/SDD
converged: NO YES NO NO
title: Mulliken charges:
elementType: O O O O C C C C C C C C C C C C C C C C H H H H H H H H H H
charge: -0.196822 -0.196888 -0.145907 -0.145884 0.353547 0.353903 0.048426 0.048080 -0.321003 -0.321131 -0.352280 -0.352201 0.027175 0.026835 -0.238079 -0.237983 -0.225750 -0.225746 -0.216276 -0.216293 0.277529 0.277644 0.275554 0.275563 0.238357 0.238367 0.237956 0.237962 0.237669 0.237676
chargesum: 0.00000
title: Mulliken charges with hydrogens summed into heavy atoms:
elementType: O O O O C C C C C C C C C C C C C C C C
charge: -0.196822 -0.196888 -0.145907 -0.145884 0.353547 0.353903 0.048426 0.048080 -0.043474 -0.043487 -0.076727 -0.076638 0.027175 0.026835 0.000278 0.000384 0.012206 0.012216 0.021393 0.021383
polarizability: 3.12048905e+02 -8.93144634e-02 1.62488967e+02 -3.17590941e+01 2.40441579e-02 1.27246180e+02
1716.lowfreq: -10.8654 -4.1919 -0.0004 -0.0003 0.0007 4.1941 21.1614 23.5548 28.1469
frequency: 21.1291 23.5393 28.1454 44.3104 44.5971 117.6511 130.6282 143.0172 150.9026 158.3426 217.9579 269.1917 274.6066 318.5016 338.2549 365.3541 396.3744 396.8067 414.4432 440.0313 458.3472 468.1663 566.3469 610.7179 610.7991 623.6476 661.4520 687.2225 687.2617 697.3394 711.7343 765.9024 789.1246 802.4518 813.3196 858.8589 859.1838 894.1139 953.7407 954.1599 988.5525 988.9160 994.6305 994.8655 1011.7887 1011.8261 1019.0578 1023.6749 1052.8162 1088.1897 1090.0242 1109.6126 1176.5475 1176.7027 1193.4128 1195.5300 1281.6860 1296.6393 1324.6854 1324.8758 1389.8833 1390.0707 1436.3303 1436.6147 1479.0057 1479.1324 1514.3764 1522.1167 1581.2953 1581.9221 1609.1539 1609.2076 1617.3858 1621.6968 3133.9901 3133.9966 3146.5216 3146.5302 3157.8514 3157.8850 3168.8610 3168.9896 3184.3938 3184.5349
redmass: 4.9808 7.2960 3.8117 9.3392 6.7506 7.6492 7.9146 6.9848 5.8998 6.4220 9.9694 7.2706 7.1008 14.1663 7.5446 6.8631 2.8106 2.8142 8.0633 6.7325 4.2590 5.3176 10.3682 6.4461 6.4520 6.8057 8.2160 2.3650 2.1964 3.2916 2.4804 2.7638 3.5357 3.8029 3.9506 1.2510 1.2506 6.8334 1.4276 1.4554 5.6091 5.4706 1.4286 1.4394 1.3483 1.3471 2.9906 2.2929 3.3558 1.6207 1.6338 5.0603 1.0611 1.0603 1.1232 1.1295 4.3838 4.3448 1.3582 1.3831 8.2303 8.2771 2.3711 2.3634 2.2758 2.2751 9.8587 9.9599 5.9396 6.0381 5.9008 6.0703 12.7681 12.1785 1.0860 1.0860 1.0892 1.0892 1.0941 1.0941 1.0989 1.0989 1.0971 1.0971
irintensity: 3.4193 1.3457 0.2037 0.5916 0.4345 0.0435 6.5699 0.7114 2.5210 1.5726 14.0983 25.6487 8.5326 2.3482 21.3981 16.0889 0.1317 0.1882 10.2026 7.0476 37.9473 11.0979 42.4991 0.2356 1.0271 0.3762 79.8117 17.3582 38.1120 38.3254 47.3542 6.8475 162.6044 38.2460 14.3272 0.7562 0.0104 12.0863 5.5449 0.5412 5.0337 0.9661 1.7924 0.0099 0.0790 0.0003 1.9022 0.3353 31.6865 3.4095 8.1377 20.8413 4.0575 0.0012 55.0192 2.5476 240.4653 12.4078 11.8617 11.3420 23.1151 0.2046 40.1339 46.7578 17.2876 0.4990 609.3503 39.3641 14.3876 2.8363 77.0212 31.0664 127.4643 82.7543 0.9045 0.0213 6.6235 9.7521 22.2046 3.7880 32.9138 13.6802 11.1218 7.0032
temp: 298.150 k
press: 1.00000 atm
elementType: 8 8 8 8 6 6 6 6 6 6 6 6 6 6 6 6 6 6 6 6 1 1 1 1 1 1 1 1 1 1
symmnumber: 1
zpe: 562026.3 jmol-1
zpe.correction: 0.214065 hartree
zpe.thermalcorrener: 0.231219 hartree
zpe.thermalcorrenthalpy: 0.232163 hartree
zpe.thermalcorrgfe: 0.165650 hartree
zpe.sumelectzpe: -915.187344 hartree
zpe.sumelectthermal: -915.170189 hartree
zpe.sumelectthermalent: -915.169245 hartree
zpe.sumelectthermalfe: -915.235758 hartree
dipole: 0.0023 -4.1462 0.0040
dipole: 4.1462
quadrupole: -73.4593 -119.8751 -114.1839
quadrupole: -0.0015 -4.0792 0.0297
quadrupole: 29.0468 -17.3690 -11.6778 -0.0015 -4.0792 0.0297
hfenergy: -915.4014083 hartree
pointgroup: C01 [X(C16H10O4)]
dipole: 0.000497 1.6312416 -0.0040598 debye
polarizability: 308.0407546|-0.0779384|162.4884216|41.6326934|-0.1741542|131.2548762 unknown
InChI: InChI=1S/C16H10O4/c17-13(11-7-3-1-4-8-11)15(19)16(20)14(18)12-9-5-2-6-10-12/h1-10H
charge 0 multiplicity 1
30 atoms
O  0.655404 0.23174 -1.436183
O  -0.655419 0.239222 1.440941
O  1.406275 -2.574552 0.45094
O  -1.408093 -2.575225 -0.435618
C  2.729658 0.218656 -0.166339
C  -2.728926 0.22267 0.169747
C  1.398786 -0.296146 -0.540646
C  -1.400524 -0.294189 0.549954
C  3.501441 -0.368783 0.877176
C  -3.501001 -0.369183 -0.871107
C  3.237352 1.348988 -0.870419
C  -3.23391 1.359563 0.86516
C  0.780686 -1.559722 0.07089
C  -0.782486 -1.559939 -0.056955
C  4.761735 0.171387 1.204043
C  -4.758943 0.17297 -1.203675
C  4.496168 1.880671 -0.539742
C  -4.490372 1.893246 0.528796
C  5.261319 1.291738 0.498834
C  -5.255831 1.299846 -0.507006
H  3.118676 -1.238498 1.417048
H  -3.120311 -1.243853 -1.40443
H  2.625599 1.787284 -1.6660
H  -2.621969 1.801177 1.658759
H  5.355588 -0.279167 2.006044
H  -5.353028 -0.281045 -2.003552
H  4.885322 2.748742 -1.082138
H  -4.877451 2.766291 1.064649
H  6.24193 1.707011 0.757239
H  -6.234573 1.716701 -0.76991
